This file contains any messages produced by compilers while
running configure, to aid debugging if configure makes a mistake.

configure:2153: checking for Cygwin environment
configure:2169: cc -c   conftest.c 1>&5
configure: In function 'main':
configure:2165: error: '__CYGWIN32__' undeclared (first use in this function)
configure:2165: error: (Each undeclared identifier is reported only once
configure:2165: error: for each function it appears in.)
configure: failed program was:
#line 2158 "configure"
#include "confdefs.h"

int main() {

#ifndef __CYGWIN__
#define __CYGWIN__ __CYGWIN32__
#endif
return __CYGWIN__;
; return 0; }
configure:2186: checking for mingw32 environment
configure:2198: cc -c   conftest.c 1>&5
configure: In function 'main':
configure:2194: error: '__MINGW32__' undeclared (first use in this function)
configure:2194: error: (Each undeclared identifier is reported only once
configure:2194: error: for each function it appears in.)
configure: failed program was:
#line 2191 "configure"
#include "confdefs.h"

int main() {
return __MINGW32__;
; return 0; }
configure:2217: checking for egrep
configure:2232: checking for a sed that does not truncate output
configure:2382: checking host system type
configure:2403: checking target system type
configure:2526: checking for gcc
configure:2639: checking whether the C compiler (gcc  ) works
configure:2655: gcc -o conftest    conftest.c  1>&5
configure:2681: checking whether the C compiler (gcc  ) is a cross-compiler
configure:2686: checking whether we are using GNU C
configure:2695: gcc -E conftest.c
configure:2714: checking whether gcc accepts -g
configure:2746: checking how to run the C preprocessor
configure:2767: gcc -E  conftest.c >/dev/null 2>conftest.out
configure:2828: checking for icc
configure:2851: checking whether gcc and cc understand -c and -o together
configure:2866: gcc -c conftest.c -o conftest.o 1>&5
configure:2867: gcc -c conftest.c -o conftest.o 1>&5
configure:2872: cc -c conftest.c 1>&5
configure:2874: cc -c conftest.c -o conftest.o 1>&5
configure:2875: cc -c conftest.c -o conftest.o 1>&5
configure:2902: checking how to run the C preprocessor
configure:2982: checking for AIX
configure:3006: checking whether ln -s works
configure:3031: checking for system library directory
configure:3057: checking whether to enable runpaths
configure:3081: checking if compiler supports -R
configure:3096: gcc -o conftest -g -O2   conftest.c -R /usr/lib  1>&5
gcc: unrecognized option '-R'
/usr/lib: file not recognized: Is a directory
collect2: ld returned 1 exit status
configure: failed program was:
#line 3089 "configure"
#include "confdefs.h"

int main() {

; return 0; }
configure:3114: checking if compiler supports -Wl,-rpath,
configure:3129: gcc -o conftest -g -O2   conftest.c -Wl,-rpath,/usr/lib  1>&5
configure:3160: checking for gawk
configure:3220: checking for bison
configure:3220: checking for byacc
configure:3260: checking for bison version
configure:3298: checking for re2c
configure:3365: checking whether to enable computed goto gcc extension with re2c
configure:3677: checking whether to force non-PIC code in shared modules
configure:3707: checking whether /dev/urandom exists
configure:3786: gcc -o conftest -g -O2 -fvisibility=hidden   conftest.c  1>&5
/tmp/cccCSbwq.o: In function `main':
/tmp/php/php-5.3.0/configure:3781: undefined reference to `pthread_mutexattr_init'
/tmp/php/php-5.3.0/configure:3782: undefined reference to `pthread_create'
collect2: ld returned 1 exit status
configure: failed program was:
#line 3768 "configure"
#include "confdefs.h"

#include <pthread.h>
#include <stddef.h>

void *thread_routine(void *data) {
    return data;
}

int main() {
    pthread_t thd;
    pthread_mutexattr_t mattr;
    int data = 1;
    pthread_mutexattr_init(&mattr);
    return pthread_create(&thd, NULL, thread_routine, &data);
} 
configure:3806: checking for pthreads_cflags
configure:3846: gcc -o conftest -g -O2 -fvisibility=hidden -kthread   conftest.c  1>&5
gcc: unrecognized option '-kthread'
/tmp/cchLZ2Xe.o: In function `main':
/tmp/php/php-5.3.0/configure:3841: undefined reference to `pthread_mutexattr_init'
/tmp/php/php-5.3.0/configure:3842: undefined reference to `pthread_create'
collect2: ld returned 1 exit status
configure: failed program was:
#line 3828 "configure"
#include "confdefs.h"

#include <pthread.h>
#include <stddef.h>

void *thread_routine(void *data) {
    return data;
}

int main() {
    pthread_t thd;
    pthread_mutexattr_t mattr;
    int data = 1;
    pthread_mutexattr_init(&mattr);
    return pthread_create(&thd, NULL, thread_routine, &data);
} 
configure:3846: gcc -o conftest -g -O2 -fvisibility=hidden -pthread   conftest.c  1>&5
configure:3876: checking for pthreads_lib
configure:4050: checking for AOLserver support
configure:4307: checking for Apache 1.x module support via DSO through APXS
configure:4630: checking for Apache 1.x module support
configure:5463: checking whether to enable Apache charset compatibility option
configure:5636: checking for Apache 2.0 filter-module support via DSO through APXS
configure:6484: checking for Apache 2.0 handler-module support via DSO through APXS
configure:7333: checking for Apache 1.x (hooks) module support via DSO through APXS
configure:7656: checking for Apache 1.x (hooks) module support
configure:8489: checking whether to enable Apache charset compatibility option
configure:8663: checking for Caudium support
configure:9014: checking for CLI build
configure:9060: checking for Continuity support
configure:9337: checking for embedded SAPI library support
configure:9554: checking for Zeus ISAPI support
configure:9803: checking for Milter support
configure:10087: checking for NSAPI support
configure:10439: checking for PHTTPD support
configure:10685: checking for Pi3Web support
configure:11052: checking whether Roxen module is build using ZTS
configure:11076: checking for Roxen/Pike support
configure:11354: checking for thttpd
configure:11615: checking for TUX
configure:11861: checking for webjames
configure:12113: checking whether to build CGI binary
configure:12118: checking for socklen_t in sys/socket.h
configure:12140: checking for sun_len in sys/un.h
configure:12162: checking whether cross-process locking is required by accept()
configure:12395: checking for chosen SAPI module
configure:12452: checking for sendmail
configure:12491: checking whether system uses EBCDIC
configure:12510: gcc -o conftest -g -O2 -fvisibility=hidden   conftest.c  1>&5
configure: failed program was:
#line 12502 "configure"
#include "confdefs.h"

int main(void) { 
  return (unsigned char)'A' != (unsigned char)0xC1; 
} 

configure:12538: checking whether byte ordering is bigendian
configure:12564: gcc -o conftest -g -O2 -fvisibility=hidden   conftest.c  1>&5
configure: failed program was:
#line 12548 "configure"
#include "confdefs.h"

int main(void)
{
  short one = 1;
  char *cp = (char *)&one;

  if (*cp == 0) {
    return(0);
  } else {
    return(1);
  }
}
  
configure:12590: checking whether writing to stdout works
configure:12619: gcc -o conftest -g -O2 -fvisibility=hidden   conftest.c  1>&5
configure:12694: checking for socket
configure:12722: gcc -o conftest -g -O2 -fvisibility=hidden   conftest.c  1>&5
configure:12951: checking for socketpair
configure:12979: gcc -o conftest -g -O2 -fvisibility=hidden   conftest.c  1>&5
configure:13208: checking for htonl
configure:13236: gcc -o conftest -g -O2 -fvisibility=hidden   conftest.c  1>&5
configure:13465: checking for gethostname
configure:13493: gcc -o conftest -g -O2 -fvisibility=hidden   conftest.c  1>&5
configure:13722: checking for gethostbyaddr
configure:13750: gcc -o conftest -g -O2 -fvisibility=hidden   conftest.c  1>&5
configure:13979: checking for yp_get_default_domain
configure:14007: gcc -o conftest -g -O2 -fvisibility=hidden   conftest.c  1>&5
/tmp/ccIbWyBm.o: In function `main':
/tmp/php/php-5.3.0/configure:14001: undefined reference to `yp_get_default_domain'
collect2: ld returned 1 exit status
configure: failed program was:
#line 13984 "configure"
#include "confdefs.h"
/* System header to define __stub macros and hopefully few prototypes,
    which can conflict with char yp_get_default_domain(); below.  */
#include <assert.h>
/* Override any gcc2 internal prototype to avoid an error.  */
/* We use char because int might match the return type of a gcc2
    builtin and then its argument prototype would still apply.  */
char yp_get_default_domain();

int main() {

/* The GNU C library defines this for functions which it implements
    to always fail with ENOSYS.  Some functions are actually named
    something starting with __ and the normal name is an alias.  */
#if defined (__stub_yp_get_default_domain) || defined (__stub___yp_get_default_domain)
choke me
#else
yp_get_default_domain();
#endif

; return 0; }
configure:14025: checking for __yp_get_default_domain
configure:14053: gcc -o conftest -g -O2 -fvisibility=hidden   conftest.c  1>&5
/tmp/cco2lfZb.o: In function `main':
/tmp/php/php-5.3.0/configure:14047: undefined reference to `__yp_get_default_domain'
collect2: ld returned 1 exit status
configure: failed program was:
#line 14030 "configure"
#include "confdefs.h"
/* System header to define __stub macros and hopefully few prototypes,
    which can conflict with char __yp_get_default_domain(); below.  */
#include <assert.h>
/* Override any gcc2 internal prototype to avoid an error.  */
/* We use char because int might match the return type of a gcc2
    builtin and then its argument prototype would still apply.  */
char __yp_get_default_domain();

int main() {

/* The GNU C library defines this for functions which it implements
    to always fail with ENOSYS.  Some functions are actually named
    something starting with __ and the normal name is an alias.  */
#if defined (__stub___yp_get_default_domain) || defined (__stub_____yp_get_default_domain)
choke me
#else
__yp_get_default_domain();
#endif

; return 0; }
configure:14091: checking for yp_get_default_domain in -lnsl
configure:14110: gcc -o conftest -g -O2 -fvisibility=hidden   conftest.c -lnsl   1>&5
configure:14185: gcc -o conftest -g -O2 -fvisibility=hidden   conftest.c  -lnsl 1>&5
configure:14237: checking for dlopen
configure:14265: gcc -o conftest -g -O2 -fvisibility=hidden   conftest.c -lnsl  1>&5
/tmp/cczMBArh.o: In function `main':
/tmp/php/php-5.3.0/configure:14259: undefined reference to `dlopen'
collect2: ld returned 1 exit status
configure: failed program was:
#line 14242 "configure"
#include "confdefs.h"
/* System header to define __stub macros and hopefully few prototypes,
    which can conflict with char dlopen(); below.  */
#include <assert.h>
/* Override any gcc2 internal prototype to avoid an error.  */
/* We use char because int might match the return type of a gcc2
    builtin and then its argument prototype would still apply.  */
char dlopen();

int main() {

/* The GNU C library defines this for functions which it implements
    to always fail with ENOSYS.  Some functions are actually named
    something starting with __ and the normal name is an alias.  */
#if defined (__stub_dlopen) || defined (__stub___dlopen)
choke me
#else
dlopen();
#endif

; return 0; }
configure:14283: checking for __dlopen
configure:14311: gcc -o conftest -g -O2 -fvisibility=hidden   conftest.c -lnsl  1>&5
/tmp/ccQQAdt1.o: In function `main':
/tmp/php/php-5.3.0/configure:14305: undefined reference to `__dlopen'
collect2: ld returned 1 exit status
configure: failed program was:
#line 14288 "configure"
#include "confdefs.h"
/* System header to define __stub macros and hopefully few prototypes,
    which can conflict with char __dlopen(); below.  */
#include <assert.h>
/* Override any gcc2 internal prototype to avoid an error.  */
/* We use char because int might match the return type of a gcc2
    builtin and then its argument prototype would still apply.  */
char __dlopen();

int main() {

/* The GNU C library defines this for functions which it implements
    to always fail with ENOSYS.  Some functions are actually named
    something starting with __ and the normal name is an alias.  */
#if defined (__stub___dlopen) || defined (__stub_____dlopen)
choke me
#else
__dlopen();
#endif

; return 0; }
configure:14349: checking for dlopen in -ldl
configure:14368: gcc -o conftest -g -O2 -fvisibility=hidden   conftest.c -ldl  -lnsl  1>&5
configure:14443: gcc -o conftest -g -O2 -fvisibility=hidden   conftest.c -lnsl  -ldl 1>&5
configure:14495: checking for sin in -lm
configure:14514: gcc -o conftest -g -O2 -fvisibility=hidden   conftest.c -lm  -ldl -lnsl  1>&5
configure:14507: warning: conflicting types for built-in function 'sin'
configure:14548: checking for res_search
configure:14576: gcc -o conftest -g -O2 -fvisibility=hidden   conftest.c -lm -ldl -lnsl  1>&5
/tmp/ccMMiced.o: In function `main':
/tmp/php/php-5.3.0/configure:14570: undefined reference to `res_search'
collect2: ld returned 1 exit status
configure: failed program was:
#line 14553 "configure"
#include "confdefs.h"
/* System header to define __stub macros and hopefully few prototypes,
    which can conflict with char res_search(); below.  */
#include <assert.h>
/* Override any gcc2 internal prototype to avoid an error.  */
/* We use char because int might match the return type of a gcc2
    builtin and then its argument prototype would still apply.  */
char res_search();

int main() {

/* The GNU C library defines this for functions which it implements
    to always fail with ENOSYS.  Some functions are actually named
    something starting with __ and the normal name is an alias.  */
#if defined (__stub_res_search) || defined (__stub___res_search)
choke me
#else
res_search();
#endif

; return 0; }
configure:14594: checking for __res_search
configure:14622: gcc -o conftest -g -O2 -fvisibility=hidden   conftest.c -lm -ldl -lnsl  1>&5
/tmp/ccSzXuRJ.o: In function `main':
/tmp/php/php-5.3.0/configure:14616: undefined reference to `__res_search'
collect2: ld returned 1 exit status
configure: failed program was:
#line 14599 "configure"
#include "confdefs.h"
/* System header to define __stub macros and hopefully few prototypes,
    which can conflict with char __res_search(); below.  */
#include <assert.h>
/* Override any gcc2 internal prototype to avoid an error.  */
/* We use char because int might match the return type of a gcc2
    builtin and then its argument prototype would still apply.  */
char __res_search();

int main() {

/* The GNU C library defines this for functions which it implements
    to always fail with ENOSYS.  Some functions are actually named
    something starting with __ and the normal name is an alias.  */
#if defined (__stub___res_search) || defined (__stub_____res_search)
choke me
#else
__res_search();
#endif

; return 0; }
configure:14660: checking for res_search in -lresolv
configure:14679: gcc -o conftest -g -O2 -fvisibility=hidden   conftest.c -lresolv  -lm -ldl -lnsl  1>&5
configure:14754: gcc -o conftest -g -O2 -fvisibility=hidden   conftest.c -lm -ldl -lnsl  -lresolv 1>&5
configure:15084: checking for inet_aton
configure:15112: gcc -o conftest -g -O2 -fvisibility=hidden   conftest.c -lresolv -lm -ldl -lnsl  1>&5
configure:15480: checking for dn_skipname
configure:15508: gcc -o conftest -g -O2 -fvisibility=hidden   conftest.c -lresolv -lm -ldl -lnsl  1>&5
/tmp/ccg18SF7.o: In function `main':
/tmp/php/php-5.3.0/configure:15502: undefined reference to `dn_skipname'
collect2: ld returned 1 exit status
configure: failed program was:
#line 15485 "configure"
#include "confdefs.h"
/* System header to define __stub macros and hopefully few prototypes,
    which can conflict with char dn_skipname(); below.  */
#include <assert.h>
/* Override any gcc2 internal prototype to avoid an error.  */
/* We use char because int might match the return type of a gcc2
    builtin and then its argument prototype would still apply.  */
char dn_skipname();

int main() {

/* The GNU C library defines this for functions which it implements
    to always fail with ENOSYS.  Some functions are actually named
    something starting with __ and the normal name is an alias.  */
#if defined (__stub_dn_skipname) || defined (__stub___dn_skipname)
choke me
#else
dn_skipname();
#endif

; return 0; }
configure:15526: checking for __dn_skipname
configure:15554: gcc -o conftest -g -O2 -fvisibility=hidden   conftest.c -lresolv -lm -ldl -lnsl  1>&5
configure:15874: checking for ANSI C header files
configure:15887: gcc -E  conftest.c >/dev/null 2>conftest.out
configure:15954: gcc -o conftest -g -O2 -fvisibility=hidden   conftest.c -lresolv -lm -ldl -lnsl  1>&5
configure: In function 'main':
configure:15949: warning: incompatible implicit declaration of built-in function 'exit'
configure:15982: checking for dirent.h that defines DIR
configure:15995: gcc -c -g -O2 -fvisibility=hidden  conftest.c 1>&5
configure:16020: checking for opendir in -ldir
configure:16039: gcc -o conftest -g -O2 -fvisibility=hidden   conftest.c -ldir  -lresolv -lm -ldl -lnsl  1>&5
/usr/lib/gcc/i486-slackware-linux/4.1.2/../../../../i486-slackware-linux/bin/ld: cannot find -ldir
collect2: ld returned 1 exit status
configure: failed program was:
#line 16028 "configure"
#include "confdefs.h"
/* Override any gcc2 internal prototype to avoid an error.  */
/* We use char because int might match the return type of a gcc2
    builtin and then its argument prototype would still apply.  */
char opendir();

int main() {
opendir()
; return 0; }
configure:16161: checking for inttypes.h
configure:16171: gcc -E  conftest.c >/dev/null 2>conftest.out
configure:16161: checking for stdint.h
configure:16171: gcc -E  conftest.c >/dev/null 2>conftest.out
configure:16161: checking for dirent.h
configure:16171: gcc -E  conftest.c >/dev/null 2>conftest.out
configure:16161: checking for ApplicationServices/ApplicationServices.h
configure:16171: gcc -E  conftest.c >/dev/null 2>conftest.out
configure:16167:53: error: ApplicationServices/ApplicationServices.h: No such file or directory
configure: failed program was:
#line 16166 "configure"
#include "confdefs.h"
#include <ApplicationServices/ApplicationServices.h>
configure:16161: checking for sys/param.h
configure:16171: gcc -E  conftest.c >/dev/null 2>conftest.out
configure:16161: checking for sys/types.h
configure:16171: gcc -E  conftest.c >/dev/null 2>conftest.out
configure:16161: checking for sys/time.h
configure:16171: gcc -E  conftest.c >/dev/null 2>conftest.out
configure:16161: checking for netinet/in.h
configure:16171: gcc -E  conftest.c >/dev/null 2>conftest.out
configure:16161: checking for alloca.h
configure:16171: gcc -E  conftest.c >/dev/null 2>conftest.out
configure:16161: checking for arpa/inet.h
configure:16171: gcc -E  conftest.c >/dev/null 2>conftest.out
configure:16161: checking for arpa/nameser.h
configure:16171: gcc -E  conftest.c >/dev/null 2>conftest.out
configure:16161: checking for assert.h
configure:16171: gcc -E  conftest.c >/dev/null 2>conftest.out
configure:16161: checking for crypt.h
configure:16171: gcc -E  conftest.c >/dev/null 2>conftest.out
configure:16161: checking for fcntl.h
configure:16171: gcc -E  conftest.c >/dev/null 2>conftest.out
configure:16161: checking for grp.h
configure:16171: gcc -E  conftest.c >/dev/null 2>conftest.out
configure:16161: checking for ieeefp.h
configure:16171: gcc -E  conftest.c >/dev/null 2>conftest.out
configure:16167:20: error: ieeefp.h: No such file or directory
configure: failed program was:
#line 16166 "configure"
#include "confdefs.h"
#include <ieeefp.h>
configure:16161: checking for langinfo.h
configure:16171: gcc -E  conftest.c >/dev/null 2>conftest.out
configure:16161: checking for limits.h
configure:16171: gcc -E  conftest.c >/dev/null 2>conftest.out
configure:16161: checking for locale.h
configure:16171: gcc -E  conftest.c >/dev/null 2>conftest.out
configure:16161: checking for monetary.h
configure:16171: gcc -E  conftest.c >/dev/null 2>conftest.out
configure:16161: checking for netdb.h
configure:16171: gcc -E  conftest.c >/dev/null 2>conftest.out
configure:16161: checking for pwd.h
configure:16171: gcc -E  conftest.c >/dev/null 2>conftest.out
configure:16161: checking for resolv.h
configure:16171: gcc -E  conftest.c >/dev/null 2>conftest.out
configure:16161: checking for signal.h
configure:16171: gcc -E  conftest.c >/dev/null 2>conftest.out
configure:16161: checking for stdarg.h
configure:16171: gcc -E  conftest.c >/dev/null 2>conftest.out
configure:16161: checking for stdlib.h
configure:16171: gcc -E  conftest.c >/dev/null 2>conftest.out
configure:16161: checking for string.h
configure:16171: gcc -E  conftest.c >/dev/null 2>conftest.out
configure:16161: checking for syslog.h
configure:16171: gcc -E  conftest.c >/dev/null 2>conftest.out
configure:16161: checking for sysexits.h
configure:16171: gcc -E  conftest.c >/dev/null 2>conftest.out
configure:16161: checking for sys/ioctl.h
configure:16171: gcc -E  conftest.c >/dev/null 2>conftest.out
configure:16161: checking for sys/file.h
configure:16171: gcc -E  conftest.c >/dev/null 2>conftest.out
configure:16161: checking for sys/mman.h
configure:16171: gcc -E  conftest.c >/dev/null 2>conftest.out
configure:16161: checking for sys/mount.h
configure:16171: gcc -E  conftest.c >/dev/null 2>conftest.out
configure:16161: checking for sys/poll.h
configure:16171: gcc -E  conftest.c >/dev/null 2>conftest.out
configure:16161: checking for sys/resource.h
configure:16171: gcc -E  conftest.c >/dev/null 2>conftest.out
configure:16161: checking for sys/select.h
configure:16171: gcc -E  conftest.c >/dev/null 2>conftest.out
configure:16161: checking for sys/socket.h
configure:16171: gcc -E  conftest.c >/dev/null 2>conftest.out
configure:16161: checking for sys/stat.h
configure:16171: gcc -E  conftest.c >/dev/null 2>conftest.out
configure:16161: checking for sys/statfs.h
configure:16171: gcc -E  conftest.c >/dev/null 2>conftest.out
configure:16161: checking for sys/statvfs.h
configure:16171: gcc -E  conftest.c >/dev/null 2>conftest.out
configure:16161: checking for sys/vfs.h
configure:16171: gcc -E  conftest.c >/dev/null 2>conftest.out
configure:16161: checking for sys/sysexits.h
configure:16171: gcc -E  conftest.c >/dev/null 2>conftest.out
configure:16167:26: error: sys/sysexits.h: No such file or directory
configure: failed program was:
#line 16166 "configure"
#include "confdefs.h"
#include <sys/sysexits.h>
configure:16161: checking for sys/varargs.h
configure:16171: gcc -E  conftest.c >/dev/null 2>conftest.out
configure:16167:25: error: sys/varargs.h: No such file or directory
configure: failed program was:
#line 16166 "configure"
#include "confdefs.h"
#include <sys/varargs.h>
configure:16161: checking for sys/wait.h
configure:16171: gcc -E  conftest.c >/dev/null 2>conftest.out
configure:16161: checking for sys/loadavg.h
configure:16171: gcc -E  conftest.c >/dev/null 2>conftest.out
configure:16167:25: error: sys/loadavg.h: No such file or directory
configure: failed program was:
#line 16166 "configure"
#include "confdefs.h"
#include <sys/loadavg.h>
configure:16161: checking for termios.h
configure:16171: gcc -E  conftest.c >/dev/null 2>conftest.out
configure:16161: checking for unistd.h
configure:16171: gcc -E  conftest.c >/dev/null 2>conftest.out
configure:16161: checking for unix.h
configure:16171: gcc -E  conftest.c >/dev/null 2>conftest.out
configure:16167:18: error: unix.h: No such file or directory
configure: failed program was:
#line 16166 "configure"
#include "confdefs.h"
#include <unix.h>
configure:16161: checking for utime.h
configure:16171: gcc -E  conftest.c >/dev/null 2>conftest.out
configure:16161: checking for sys/utsname.h
configure:16171: gcc -E  conftest.c >/dev/null 2>conftest.out
configure:16161: checking for sys/ipc.h
configure:16171: gcc -E  conftest.c >/dev/null 2>conftest.out
configure:16161: checking for dlfcn.h
configure:16171: gcc -E  conftest.c >/dev/null 2>conftest.out
configure:16161: checking for assert.h
configure:16206: checking for mach-o/dyld.h
configure:16216: gcc -E  conftest.c >/dev/null 2>conftest.out
configure:16212:25: error: mach-o/dyld.h: No such file or directory
configure: failed program was:
#line 16211 "configure"
#include "confdefs.h"
#include <mach-o/dyld.h>
configure:16247: checking for fopencookie
configure:16275: gcc -o conftest -g -O2 -fvisibility=hidden   conftest.c -lresolv -lm -ldl -lnsl  1>&5
configure:16307: gcc -c -g -O2 -fvisibility=hidden  conftest.c 1>&5
configure:16358: gcc -o conftest -g -O2 -fvisibility=hidden   conftest.c -lresolv -lm -ldl -lnsl  1>&5
configure: In function 'main':
configure:16351: warning: incompatible implicit declaration of built-in function 'exit'
configure:16422: checking for broken getcwd
configure:16437: checking for broken libc stdio
configure:16498: gcc -o conftest -g -O2 -fvisibility=hidden   conftest.c -lresolv -lm -ldl -lnsl  1>&5
configure: In function 'main':
configure:16482: warning: incompatible implicit declaration of built-in function 'exit'
configure: failed program was:
#line 16470 "configure"
#include "confdefs.h"

#include <stdio.h>
int main(int argc, char *argv[])
{
  FILE *fp;
  long position;
  char *filename = "/tmp/phpglibccheck";
  
  fp = fopen(filename, "w");
  if (fp == NULL) {
    perror("fopen");
    exit(2);
  }
  fputs("foobar", fp);
  fclose(fp);

  fp = fopen(filename, "a+");
  position = ftell(fp);
  fclose(fp);
  unlink(filename);
  if (position == 0)
  return 1;
  return 0;
}

configure:16526: checking whether struct tm is in sys/time.h or time.h
configure:16539: gcc -c -g -O2 -fvisibility=hidden  conftest.c 1>&5
configure:16560: checking for tm_zone in struct tm
configure:16573: gcc -c -g -O2 -fvisibility=hidden  conftest.c 1>&5
configure:16632: checking for missing declarations of reentrant functions
configure:16641: gcc -c -g -O2 -fvisibility=hidden  conftest.c 1>&5
configure:16666: gcc -c -g -O2 -fvisibility=hidden  conftest.c 1>&5
configure:16691: gcc -c -g -O2 -fvisibility=hidden  conftest.c 1>&5
configure:16716: gcc -c -g -O2 -fvisibility=hidden  conftest.c 1>&5
configure:16741: gcc -c -g -O2 -fvisibility=hidden  conftest.c 1>&5
configure:16762: checking for fclose declaration
configure:16771: gcc -c -g -O2 -fvisibility=hidden  conftest.c 1>&5
configure:16797: checking for tm_gmtoff in struct tm
configure:16810: gcc -c -g -O2 -fvisibility=hidden  conftest.c 1>&5
configure:16833: checking for struct flock
configure:16848: gcc -c -g -O2 -fvisibility=hidden  conftest.c 1>&5
configure:16875: checking for socklen_t
configure:16892: gcc -c -g -O2 -fvisibility=hidden  conftest.c 1>&5
configure:16918: checking size of size_t
configure:16938: gcc -o conftest -g -O2 -fvisibility=hidden   conftest.c -lresolv -lm -ldl -lnsl  1>&5
configure: In function 'main':
configure:16932: warning: incompatible implicit declaration of built-in function 'exit'
configure:16958: checking size of long long
configure:16978: gcc -o conftest -g -O2 -fvisibility=hidden   conftest.c -lresolv -lm -ldl -lnsl  1>&5
configure: In function 'main':
configure:16972: warning: incompatible implicit declaration of built-in function 'exit'
configure:16998: checking size of long long int
configure:17018: gcc -o conftest -g -O2 -fvisibility=hidden   conftest.c -lresolv -lm -ldl -lnsl  1>&5
configure: In function 'main':
configure:17012: warning: incompatible implicit declaration of built-in function 'exit'
configure:17038: checking size of long
configure:17058: gcc -o conftest -g -O2 -fvisibility=hidden   conftest.c -lresolv -lm -ldl -lnsl  1>&5
configure: In function 'main':
configure:17052: warning: incompatible implicit declaration of built-in function 'exit'
configure:17078: checking size of int
configure:17098: gcc -o conftest -g -O2 -fvisibility=hidden   conftest.c -lresolv -lm -ldl -lnsl  1>&5
configure: In function 'main':
configure:17092: warning: incompatible implicit declaration of built-in function 'exit'
configure:17120: checking size of intmax_t
configure:17161: gcc -o conftest -g -O2 -fvisibility=hidden   conftest.c  1>&5
configure:17200: checking size of ssize_t
configure:17241: gcc -o conftest -g -O2 -fvisibility=hidden   conftest.c  1>&5
configure:17280: checking size of ptrdiff_t
configure:17321: gcc -o conftest -g -O2 -fvisibility=hidden   conftest.c  1>&5
configure:17360: checking for st_blksize in struct stat
configure:17373: gcc -c -g -O2 -fvisibility=hidden  conftest.c 1>&5
configure:17395: checking for st_blocks in struct stat
configure:17408: gcc -c -g -O2 -fvisibility=hidden  conftest.c 1>&5
configure:17435: checking for st_rdev in struct stat
configure:17448: gcc -c -g -O2 -fvisibility=hidden  conftest.c 1>&5
configure:17470: checking for size_t
configure:17503: checking for uid_t in sys/types.h
configure:17539: checking for struct sockaddr_storage
configure:17552: gcc -c -g -O2 -fvisibility=hidden  conftest.c 1>&5
configure:17573: checking for field sa_len in struct sockaddr
configure:17587: gcc -c -g -O2 -fvisibility=hidden  conftest.c 1>&5
configure: In function 'main':
configure:17583: error: 'struct sockaddr' has no member named 'sa_len'
configure: failed program was:
#line 17579 "configure"
#include "confdefs.h"
#include <sys/types.h>
#include <sys/socket.h>
int main() {
static struct sockaddr sa; int n = (int) sa.sa_len; return n;
; return 0; }
configure:17610: checking for IPv6 support
configure:17624: gcc -o conftest -g -O2 -fvisibility=hidden   conftest.c -lresolv -lm -ldl -lnsl  1>&5
configure:17640: checking for vprintf
configure:17668: gcc -o conftest -g -O2 -fvisibility=hidden   conftest.c -lresolv -lm -ldl -lnsl  1>&5
configure:17652: warning: conflicting types for built-in function 'vprintf'
configure:17826: checking for alphasort
configure:17854: gcc -o conftest -g -O2 -fvisibility=hidden   conftest.c -lresolv -lm -ldl -lnsl  1>&5
configure:17826: checking for asctime_r
configure:17854: gcc -o conftest -g -O2 -fvisibility=hidden   conftest.c -lresolv -lm -ldl -lnsl  1>&5
configure:17826: checking for chroot
configure:17854: gcc -o conftest -g -O2 -fvisibility=hidden   conftest.c -lresolv -lm -ldl -lnsl  1>&5
configure:17826: checking for ctime_r
configure:17854: gcc -o conftest -g -O2 -fvisibility=hidden   conftest.c -lresolv -lm -ldl -lnsl  1>&5
configure:17826: checking for cuserid
configure:17854: gcc -o conftest -g -O2 -fvisibility=hidden   conftest.c -lresolv -lm -ldl -lnsl  1>&5
configure:17826: checking for crypt
configure:17854: gcc -o conftest -g -O2 -fvisibility=hidden   conftest.c -lresolv -lm -ldl -lnsl  1>&5
/tmp/cca6vv10.o: In function `main':
/tmp/php/php-5.3.0/configure:17848: undefined reference to `crypt'
collect2: ld returned 1 exit status
configure: failed program was:
#line 17831 "configure"
#include "confdefs.h"
/* System header to define __stub macros and hopefully few prototypes,
    which can conflict with char crypt(); below.  */
#include <assert.h>
/* Override any gcc2 internal prototype to avoid an error.  */
/* We use char because int might match the return type of a gcc2
    builtin and then its argument prototype would still apply.  */
char crypt();

int main() {

/* The GNU C library defines this for functions which it implements
    to always fail with ENOSYS.  Some functions are actually named
    something starting with __ and the normal name is an alias.  */
#if defined (__stub_crypt) || defined (__stub___crypt)
choke me
#else
crypt();
#endif

; return 0; }
configure:17826: checking for flock
configure:17854: gcc -o conftest -g -O2 -fvisibility=hidden   conftest.c -lresolv -lm -ldl -lnsl  1>&5
configure:17826: checking for ftok
configure:17854: gcc -o conftest -g -O2 -fvisibility=hidden   conftest.c -lresolv -lm -ldl -lnsl  1>&5
configure:17826: checking for funopen
configure:17854: gcc -o conftest -g -O2 -fvisibility=hidden   conftest.c -lresolv -lm -ldl -lnsl  1>&5
/tmp/cc4In3tA.o: In function `main':
/tmp/php/php-5.3.0/configure:17848: undefined reference to `funopen'
collect2: ld returned 1 exit status
configure: failed program was:
#line 17831 "configure"
#include "confdefs.h"
/* System header to define __stub macros and hopefully few prototypes,
    which can conflict with char funopen(); below.  */
#include <assert.h>
/* Override any gcc2 internal prototype to avoid an error.  */
/* We use char because int might match the return type of a gcc2
    builtin and then its argument prototype would still apply.  */
char funopen();

int main() {

/* The GNU C library defines this for functions which it implements
    to always fail with ENOSYS.  Some functions are actually named
    something starting with __ and the normal name is an alias.  */
#if defined (__stub_funopen) || defined (__stub___funopen)
choke me
#else
funopen();
#endif

; return 0; }
configure:17826: checking for gai_strerror
configure:17854: gcc -o conftest -g -O2 -fvisibility=hidden   conftest.c -lresolv -lm -ldl -lnsl  1>&5
configure:17826: checking for gcvt
configure:17854: gcc -o conftest -g -O2 -fvisibility=hidden   conftest.c -lresolv -lm -ldl -lnsl  1>&5
configure:17826: checking for getloadavg
configure:17854: gcc -o conftest -g -O2 -fvisibility=hidden   conftest.c -lresolv -lm -ldl -lnsl  1>&5
configure:17826: checking for getlogin
configure:17854: gcc -o conftest -g -O2 -fvisibility=hidden   conftest.c -lresolv -lm -ldl -lnsl  1>&5
configure:17826: checking for getprotobyname
configure:17854: gcc -o conftest -g -O2 -fvisibility=hidden   conftest.c -lresolv -lm -ldl -lnsl  1>&5
configure:17826: checking for getprotobynumber
configure:17854: gcc -o conftest -g -O2 -fvisibility=hidden   conftest.c -lresolv -lm -ldl -lnsl  1>&5
configure:17826: checking for getservbyname
configure:17854: gcc -o conftest -g -O2 -fvisibility=hidden   conftest.c -lresolv -lm -ldl -lnsl  1>&5
configure:17826: checking for getservbyport
configure:17854: gcc -o conftest -g -O2 -fvisibility=hidden   conftest.c -lresolv -lm -ldl -lnsl  1>&5
configure:17826: checking for getrusage
configure:17854: gcc -o conftest -g -O2 -fvisibility=hidden   conftest.c -lresolv -lm -ldl -lnsl  1>&5
configure:17826: checking for gettimeofday
configure:17854: gcc -o conftest -g -O2 -fvisibility=hidden   conftest.c -lresolv -lm -ldl -lnsl  1>&5
configure:17826: checking for gmtime_r
configure:17854: gcc -o conftest -g -O2 -fvisibility=hidden   conftest.c -lresolv -lm -ldl -lnsl  1>&5
configure:17826: checking for getpwnam_r
configure:17854: gcc -o conftest -g -O2 -fvisibility=hidden   conftest.c -lresolv -lm -ldl -lnsl  1>&5
configure:17826: checking for getgrnam_r
configure:17854: gcc -o conftest -g -O2 -fvisibility=hidden   conftest.c -lresolv -lm -ldl -lnsl  1>&5
configure:17826: checking for getpwuid_r
configure:17854: gcc -o conftest -g -O2 -fvisibility=hidden   conftest.c -lresolv -lm -ldl -lnsl  1>&5
configure:17826: checking for grantpt
configure:17854: gcc -o conftest -g -O2 -fvisibility=hidden   conftest.c -lresolv -lm -ldl -lnsl  1>&5
configure:17826: checking for inet_ntoa
configure:17854: gcc -o conftest -g -O2 -fvisibility=hidden   conftest.c -lresolv -lm -ldl -lnsl  1>&5
configure:17826: checking for inet_ntop
configure:17854: gcc -o conftest -g -O2 -fvisibility=hidden   conftest.c -lresolv -lm -ldl -lnsl  1>&5
configure:17826: checking for inet_pton
configure:17854: gcc -o conftest -g -O2 -fvisibility=hidden   conftest.c -lresolv -lm -ldl -lnsl  1>&5
configure:17826: checking for isascii
configure:17854: gcc -o conftest -g -O2 -fvisibility=hidden   conftest.c -lresolv -lm -ldl -lnsl  1>&5
configure:17838: warning: conflicting types for built-in function 'isascii'
configure:17826: checking for link
configure:17854: gcc -o conftest -g -O2 -fvisibility=hidden   conftest.c -lresolv -lm -ldl -lnsl  1>&5
configure:17826: checking for localtime_r
configure:17854: gcc -o conftest -g -O2 -fvisibility=hidden   conftest.c -lresolv -lm -ldl -lnsl  1>&5
configure:17826: checking for lockf
configure:17854: gcc -o conftest -g -O2 -fvisibility=hidden   conftest.c -lresolv -lm -ldl -lnsl  1>&5
configure:17826: checking for lchown
configure:17854: gcc -o conftest -g -O2 -fvisibility=hidden   conftest.c -lresolv -lm -ldl -lnsl  1>&5
configure:17826: checking for lrand48
configure:17854: gcc -o conftest -g -O2 -fvisibility=hidden   conftest.c -lresolv -lm -ldl -lnsl  1>&5
configure:17826: checking for memcpy
configure:17854: gcc -o conftest -g -O2 -fvisibility=hidden   conftest.c -lresolv -lm -ldl -lnsl  1>&5
configure:17838: warning: conflicting types for built-in function 'memcpy'
configure:17826: checking for memmove
configure:17854: gcc -o conftest -g -O2 -fvisibility=hidden   conftest.c -lresolv -lm -ldl -lnsl  1>&5
configure:17838: warning: conflicting types for built-in function 'memmove'
configure:17826: checking for mkstemp
configure:17854: gcc -o conftest -g -O2 -fvisibility=hidden   conftest.c -lresolv -lm -ldl -lnsl  1>&5
configure:17826: checking for mmap
configure:17854: gcc -o conftest -g -O2 -fvisibility=hidden   conftest.c -lresolv -lm -ldl -lnsl  1>&5
configure:17826: checking for nl_langinfo
configure:17854: gcc -o conftest -g -O2 -fvisibility=hidden   conftest.c -lresolv -lm -ldl -lnsl  1>&5
configure:17826: checking for perror
configure:17854: gcc -o conftest -g -O2 -fvisibility=hidden   conftest.c -lresolv -lm -ldl -lnsl  1>&5
configure:17826: checking for poll
configure:17854: gcc -o conftest -g -O2 -fvisibility=hidden   conftest.c -lresolv -lm -ldl -lnsl  1>&5
configure:17826: checking for ptsname
configure:17854: gcc -o conftest -g -O2 -fvisibility=hidden   conftest.c -lresolv -lm -ldl -lnsl  1>&5
configure:17826: checking for putenv
configure:17854: gcc -o conftest -g -O2 -fvisibility=hidden   conftest.c -lresolv -lm -ldl -lnsl  1>&5
configure:17826: checking for realpath
configure:17854: gcc -o conftest -g -O2 -fvisibility=hidden   conftest.c -lresolv -lm -ldl -lnsl  1>&5
configure:17826: checking for random
configure:17854: gcc -o conftest -g -O2 -fvisibility=hidden   conftest.c -lresolv -lm -ldl -lnsl  1>&5
configure:17826: checking for rand_r
configure:17854: gcc -o conftest -g -O2 -fvisibility=hidden   conftest.c -lresolv -lm -ldl -lnsl  1>&5
configure:17826: checking for res_search
configure:17826: checking for scandir
configure:17854: gcc -o conftest -g -O2 -fvisibility=hidden   conftest.c -lresolv -lm -ldl -lnsl  1>&5
configure:17826: checking for setitimer
configure:17854: gcc -o conftest -g -O2 -fvisibility=hidden   conftest.c -lresolv -lm -ldl -lnsl  1>&5
configure:17826: checking for setlocale
configure:17854: gcc -o conftest -g -O2 -fvisibility=hidden   conftest.c -lresolv -lm -ldl -lnsl  1>&5
configure:17826: checking for localeconv
configure:17854: gcc -o conftest -g -O2 -fvisibility=hidden   conftest.c -lresolv -lm -ldl -lnsl  1>&5
configure:17826: checking for setenv
configure:17854: gcc -o conftest -g -O2 -fvisibility=hidden   conftest.c -lresolv -lm -ldl -lnsl  1>&5
configure:17826: checking for setpgid
configure:17854: gcc -o conftest -g -O2 -fvisibility=hidden   conftest.c -lresolv -lm -ldl -lnsl  1>&5
configure:17826: checking for setsockopt
configure:17854: gcc -o conftest -g -O2 -fvisibility=hidden   conftest.c -lresolv -lm -ldl -lnsl  1>&5
configure:17826: checking for setvbuf
configure:17854: gcc -o conftest -g -O2 -fvisibility=hidden   conftest.c -lresolv -lm -ldl -lnsl  1>&5
configure:17826: checking for shutdown
configure:17854: gcc -o conftest -g -O2 -fvisibility=hidden   conftest.c -lresolv -lm -ldl -lnsl  1>&5
configure:17826: checking for sin
configure:17854: gcc -o conftest -g -O2 -fvisibility=hidden   conftest.c -lresolv -lm -ldl -lnsl  1>&5
configure:17838: warning: conflicting types for built-in function 'sin'
configure:17826: checking for snprintf
configure:17854: gcc -o conftest -g -O2 -fvisibility=hidden   conftest.c -lresolv -lm -ldl -lnsl  1>&5
configure:17838: warning: conflicting types for built-in function 'snprintf'
configure:17826: checking for srand48
configure:17854: gcc -o conftest -g -O2 -fvisibility=hidden   conftest.c -lresolv -lm -ldl -lnsl  1>&5
configure:17826: checking for srandom
configure:17854: gcc -o conftest -g -O2 -fvisibility=hidden   conftest.c -lresolv -lm -ldl -lnsl  1>&5
configure:17826: checking for statfs
configure:17854: gcc -o conftest -g -O2 -fvisibility=hidden   conftest.c -lresolv -lm -ldl -lnsl  1>&5
configure:17826: checking for statvfs
configure:17854: gcc -o conftest -g -O2 -fvisibility=hidden   conftest.c -lresolv -lm -ldl -lnsl  1>&5
configure:17826: checking for std_syslog
configure:17854: gcc -o conftest -g -O2 -fvisibility=hidden   conftest.c -lresolv -lm -ldl -lnsl  1>&5
/tmp/ccGEi9C2.o: In function `main':
/tmp/php/php-5.3.0/configure:17848: undefined reference to `std_syslog'
collect2: ld returned 1 exit status
configure: failed program was:
#line 17831 "configure"
#include "confdefs.h"
/* System header to define __stub macros and hopefully few prototypes,
    which can conflict with char std_syslog(); below.  */
#include <assert.h>
/* Override any gcc2 internal prototype to avoid an error.  */
/* We use char because int might match the return type of a gcc2
    builtin and then its argument prototype would still apply.  */
char std_syslog();

int main() {

/* The GNU C library defines this for functions which it implements
    to always fail with ENOSYS.  Some functions are actually named
    something starting with __ and the normal name is an alias.  */
#if defined (__stub_std_syslog) || defined (__stub___std_syslog)
choke me
#else
std_syslog();
#endif

; return 0; }
configure:17826: checking for strcasecmp
configure:17854: gcc -o conftest -g -O2 -fvisibility=hidden   conftest.c -lresolv -lm -ldl -lnsl  1>&5
configure:17838: warning: conflicting types for built-in function 'strcasecmp'
configure:17826: checking for strcoll
configure:17854: gcc -o conftest -g -O2 -fvisibility=hidden   conftest.c -lresolv -lm -ldl -lnsl  1>&5
configure:17826: checking for strdup
configure:17854: gcc -o conftest -g -O2 -fvisibility=hidden   conftest.c -lresolv -lm -ldl -lnsl  1>&5
configure:17838: warning: conflicting types for built-in function 'strdup'
configure:17826: checking for strerror
configure:17854: gcc -o conftest -g -O2 -fvisibility=hidden   conftest.c -lresolv -lm -ldl -lnsl  1>&5
configure:17826: checking for strftime
configure:17854: gcc -o conftest -g -O2 -fvisibility=hidden   conftest.c -lresolv -lm -ldl -lnsl  1>&5
configure:17838: warning: conflicting types for built-in function 'strftime'
configure:17826: checking for strptime
configure:17854: gcc -o conftest -g -O2 -fvisibility=hidden   conftest.c -lresolv -lm -ldl -lnsl  1>&5
configure:17826: checking for strstr
configure:17854: gcc -o conftest -g -O2 -fvisibility=hidden   conftest.c -lresolv -lm -ldl -lnsl  1>&5
configure:17838: warning: conflicting types for built-in function 'strstr'
configure:17826: checking for strtok_r
configure:17854: gcc -o conftest -g -O2 -fvisibility=hidden   conftest.c -lresolv -lm -ldl -lnsl  1>&5
configure:17826: checking for symlink
configure:17854: gcc -o conftest -g -O2 -fvisibility=hidden   conftest.c -lresolv -lm -ldl -lnsl  1>&5
configure:17826: checking for tempnam
configure:17854: gcc -o conftest -g -O2 -fvisibility=hidden   conftest.c -lresolv -lm -ldl -lnsl  1>&5
/tmp/ccoohYej.o: In function `main':
/tmp/php/php-5.3.0/configure:17848: warning: the use of `tempnam' is dangerous, better use `mkstemp'
configure:17826: checking for tzset
configure:17854: gcc -o conftest -g -O2 -fvisibility=hidden   conftest.c -lresolv -lm -ldl -lnsl  1>&5
configure:17826: checking for unlockpt
configure:17854: gcc -o conftest -g -O2 -fvisibility=hidden   conftest.c -lresolv -lm -ldl -lnsl  1>&5
configure:17826: checking for unsetenv
configure:17854: gcc -o conftest -g -O2 -fvisibility=hidden   conftest.c -lresolv -lm -ldl -lnsl  1>&5
configure:17826: checking for usleep
configure:17854: gcc -o conftest -g -O2 -fvisibility=hidden   conftest.c -lresolv -lm -ldl -lnsl  1>&5
configure:17826: checking for nanosleep
configure:17854: gcc -o conftest -g -O2 -fvisibility=hidden   conftest.c -lresolv -lm -ldl -lnsl  1>&5
configure:17826: checking for utime
configure:17854: gcc -o conftest -g -O2 -fvisibility=hidden   conftest.c -lresolv -lm -ldl -lnsl  1>&5
configure:17826: checking for vsnprintf
configure:17854: gcc -o conftest -g -O2 -fvisibility=hidden   conftest.c -lresolv -lm -ldl -lnsl  1>&5
configure:17838: warning: conflicting types for built-in function 'vsnprintf'
configure:17880: checking for getaddrinfo
configure:17892: gcc -o conftest -g -O2 -fvisibility=hidden   conftest.c -lresolv -lm -ldl -lnsl  1>&5
configure:17938: gcc -o conftest -g -O2 -fvisibility=hidden   conftest.c -lresolv -lm -ldl -lnsl  1>&5
configure: In function 'main':
configure:17908: warning: incompatible implicit declaration of built-in function 'memset'
configure:17912: warning: incompatible implicit declaration of built-in function 'exit'
configure:17916: warning: incompatible implicit declaration of built-in function 'exit'
configure:17924: warning: incompatible implicit declaration of built-in function 'exit'
configure:17928: warning: incompatible implicit declaration of built-in function 'exit'
configure:17933: warning: incompatible implicit declaration of built-in function 'exit'
configure:17970: checking for strlcat
configure:17998: gcc -o conftest -g -O2 -fvisibility=hidden   conftest.c -lresolv -lm -ldl -lnsl  1>&5
/tmp/cce5Xotw.o: In function `main':
/tmp/php/php-5.3.0/configure:17992: undefined reference to `strlcat'
collect2: ld returned 1 exit status
configure: failed program was:
#line 17975 "configure"
#include "confdefs.h"
/* System header to define __stub macros and hopefully few prototypes,
    which can conflict with char strlcat(); below.  */
#include <assert.h>
/* Override any gcc2 internal prototype to avoid an error.  */
/* We use char because int might match the return type of a gcc2
    builtin and then its argument prototype would still apply.  */
char strlcat();

int main() {

/* The GNU C library defines this for functions which it implements
    to always fail with ENOSYS.  Some functions are actually named
    something starting with __ and the normal name is an alias.  */
#if defined (__stub_strlcat) || defined (__stub___strlcat)
choke me
#else
strlcat();
#endif

; return 0; }
configure:17970: checking for strlcpy
configure:17998: gcc -o conftest -g -O2 -fvisibility=hidden   conftest.c -lresolv -lm -ldl -lnsl  1>&5
/tmp/ccY1Vtsr.o: In function `main':
/tmp/php/php-5.3.0/configure:17992: undefined reference to `strlcpy'
collect2: ld returned 1 exit status
configure: failed program was:
#line 17975 "configure"
#include "confdefs.h"
/* System header to define __stub macros and hopefully few prototypes,
    which can conflict with char strlcpy(); below.  */
#include <assert.h>
/* Override any gcc2 internal prototype to avoid an error.  */
/* We use char because int might match the return type of a gcc2
    builtin and then its argument prototype would still apply.  */
char strlcpy();

int main() {

/* The GNU C library defines this for functions which it implements
    to always fail with ENOSYS.  Some functions are actually named
    something starting with __ and the normal name is an alias.  */
#if defined (__stub_strlcpy) || defined (__stub___strlcpy)
choke me
#else
strlcpy();
#endif

; return 0; }
configure:17970: checking for getopt
configure:17998: gcc -o conftest -g -O2 -fvisibility=hidden   conftest.c -lresolv -lm -ldl -lnsl  1>&5
configure:18025: checking whether utime accepts a null argument
configure:18046: gcc -o conftest -g -O2 -fvisibility=hidden   conftest.c -lresolv -lm -ldl -lnsl  1>&5
configure: In function 'main':
configure:18040: warning: incompatible implicit declaration of built-in function 'exit'
configure:18072: checking for working alloca.h
configure:18105: checking for alloca
configure:18138: gcc -o conftest -g -O2 -fvisibility=hidden   conftest.c -lresolv -lm -ldl -lnsl  1>&5
configure:18305: checking for declared timezone
configure:18326: gcc -c -g -O2 -fvisibility=hidden  conftest.c 1>&5
configure:18352: checking for type of reentrant time-related functions
configure:18381: gcc -o conftest -g -O2 -fvisibility=hidden   conftest.c -lresolv -lm -ldl -lnsl  1>&5
configure: In function 'main':
configure:18373: warning: assignment makes integer from pointer without a cast
configure:18374: error: too many arguments to function 'asctime_r'
configure: failed program was:
#line 18363 "configure"
#include "confdefs.h"

#include <time.h>

main() {
char buf[27];
struct tm t;
time_t old = 0;
int r, s;

s = gmtime_r(&old, &t);
r = (int) asctime_r(&t, buf, 26);
if (r == s && s == 0) return (0);
return (1);
}

configure:18413: gcc -o conftest -g -O2 -fvisibility=hidden   conftest.c -lresolv -lm -ldl -lnsl  1>&5
configure: In function 'main':
configure:18406: error: too many arguments to function 'asctime_r'
configure: failed program was:
#line 18397 "configure"
#include "confdefs.h"

#include <time.h>
main() {
  struct tm t, *s;
  time_t old = 0;
  char buf[27], *p;
  
  s = gmtime_r(&old, &t);
  p = asctime_r(&t, buf, 26);
  if (p == buf && s == &t) return (0);
  return (1);
}
  
configure:18451: checking for readdir_r
configure:18479: gcc -o conftest -g -O2 -fvisibility=hidden   conftest.c -lresolv -lm -ldl -lnsl  1>&5
configure:18501: checking for type of readdir_r
configure:18537: gcc -o conftest -g -O2 -fvisibility=hidden   conftest.c -lresolv -lm -ldl -lnsl  1>&5
configure: In function 'main':
configure:18529: warning: incompatible implicit declaration of built-in function 'exit'
configure:18600: checking for in_addr_t
configure:18639: checking for crypt_r
configure:18667: gcc -o conftest -g -O2 -fvisibility=hidden   conftest.c -lresolv -lm -ldl -lnsl  1>&5
/tmp/cc0VXvKT.o: In function `main':
/tmp/php/php-5.3.0/configure:18661: undefined reference to `crypt_r'
collect2: ld returned 1 exit status
configure: failed program was:
#line 18644 "configure"
#include "confdefs.h"
/* System header to define __stub macros and hopefully few prototypes,
    which can conflict with char crypt_r(); below.  */
#include <assert.h>
/* Override any gcc2 internal prototype to avoid an error.  */
/* We use char because int might match the return type of a gcc2
    builtin and then its argument prototype would still apply.  */
char crypt_r();

int main() {

/* The GNU C library defines this for functions which it implements
    to always fail with ENOSYS.  Some functions are actually named
    something starting with __ and the normal name is an alias.  */
#if defined (__stub_crypt_r) || defined (__stub___crypt_r)
choke me
#else
crypt_r();
#endif

; return 0; }
configure:18824: checking whether to include gcov symbols
configure:18987: checking whether to include debugging symbols
configure:19029: checking layout of installed files
configure:19064: checking path to configuration file
configure:19098: checking where to scan for configuration files
configure:19134: checking whether to enable safe mode by default
configure:19169: checking for safe mode exec dir
configure:19213: checking whether to enable PHP's own SIGCHLD handler
configure:19251: checking whether to enable magic quotes by default
configure:19289: checking whether to explicitly link against libgcc
configure:19369: checking whether to enable short tags by default
configure:19407: checking whether to enable dmalloc
configure:19495: checking whether to enable IPv6 support
configure:19525: checking how big to make fd sets
configure:19635: checking which regex library to use
configure:20049: checking whether to enable LIBXML support
configure:20097: checking libxml2 install dir
configure:20126: checking for xml2-config path
configure:20284: checking whether libxml build works
configure:20311: gcc -o conftest -g -O2 -fvisibility=hidden   conftest.c 
          
         -lresolv -lm -ldl -lnsl  -lxml2 -lz -lm 1>&5
/usr/lib/gcc/i486-slackware-linux/4.1.2/../../../../i486-slackware-linux/bin/ld: cannot find -lz
collect2: ld returned 1 exit status
configure: failed program was:
#line 20300 "configure"
#include "confdefs.h"

    
    char xmlInitParser();
    int main() {
      xmlInitParser();
      return 0;
    }
  
