
=====================================================================
FAILED TEST SUMMARY
---------------------------------------------------------------------
Simple math tests [ext/standard/tests/math/abs.phpt]
Various pow() tests [ext/standard/tests/math/pow.phpt]
Simple math tests [ext/standard/tests/math/round.phpt]
Test strcspn() behavior [ext/standard/tests/strings/strcspn.phpt]
Test strspn() behavior [ext/standard/tests/strings/strspn.phpt]
General semaphore and shared memory test [ext/sysvsem/tests/sysv.phpt]
=====================================================================


================================================================================
/house/nohn/php-4.3.0RC2/ext/standard/tests/math/abs.phpt
================================================================================

---- EXPECTED OUTPUT
1,1,0,0
OK
---- ACTUAL OUTPUT
1,1,1,1

Assert failed:
-LONG_MIN+1 === abs(LONG_MIN-1)
Left:  int(-9223372036854775807)
Right: int(9223372036854775807)

Assert failed:
-LONG_MIN   === abs(LONG_MIN)
Left:  int(-9223372036854775808)
Right: float(9.2233720368548E+18)
---- FAILED

================================================================================
001- 1,1,0,0

001+ 1,1,1,1

002- OK

002+ 

003+ Assert failed:

004+ -LONG_MIN+1 === abs(LONG_MIN-1)

005+ Left:  int(-9223372036854775807)

006+ Right: int(9223372036854775807)

007+ 

008+ Assert failed:

009+ -LONG_MIN   === abs(LONG_MIN)

010+ Left:  int(-9223372036854775808)

011+ Right: float(9.2233720368548E+18)
================================================================================



================================================================================
/house/nohn/php-4.3.0RC2/ext/standard/tests/math/pow.phpt
================================================================================

---- EXPECTED OUTPUT
1,1,0,0
On failure, please mail result to php-dev@lists.php.net
OK
---- ACTUAL OUTPUT
1,1,1,1
On failure, please mail result to php-dev@lists.php.net

Assert failed:
LONG_MAX-1 === pow(LONG_MAX-1,1)
Left:  int(9223372036854775806)
Right: int(-9223372036854775808)

Assert failed:
LONG_MIN+1 === pow(LONG_MIN+1,1)
Left:  int(-9223372036854775807)
Right: int(-9223372036854775808)

Assert failed:
LONG_MAX === pow(LONG_MAX,1)
Left:  int(9223372036854775807)
Right: int(-9223372036854775808)
---- FAILED

================================================================================
001- 1,1,0,0

001+ 1,1,1,1

003- OK

003+ 

004+ Assert failed:

005+ LONG_MAX-1 === pow(LONG_MAX-1,1)

006+ Left:  int(9223372036854775806)

007+ Right: int(-9223372036854775808)

008+ 

009+ Assert failed:

010+ LONG_MIN+1 === pow(LONG_MIN+1,1)

011+ Left:  int(-9223372036854775807)

012+ Right: int(-9223372036854775808)

013+ 

014+ Assert failed:

015+ LONG_MAX === pow(LONG_MAX,1)

016+ Left:  int(9223372036854775807)

017+ Right: int(-9223372036854775808)
================================================================================



================================================================================
/house/nohn/php-4.3.0RC2/ext/standard/tests/math/round.phpt
================================================================================

---- EXPECTED OUTPUT
1,1,0,0
OK
---- ACTUAL OUTPUT
1,1,1,1

Assert failed:
 LONG_MIN-1 ~== round(LONG_MIN - 0.6)
Left:  int(9223372036854775807)
Right: float(-9.2233720368548E+18)

Assert failed:
 LONG_MIN-1 ~== floor(LONG_MIN - 0.5)
Left:  int(9223372036854775807)
Right: float(-9.2233720368548E+18)

Assert failed:
 LONG_MAX+1 ~== ceil(LONG_MAX + 0.5)
Left:  int(-9223372036854775808)
Right: float(9.2233720368548E+18)

Assert failed:
 LONG_MAX+1 ~== round(LONG_MAX + 0.6)
Left:  int(-9223372036854775808)
Right: float(9.2233720368548E+18)
---- FAILED

================================================================================
001- 1,1,0,0

001+ 1,1,1,1

002- OK

002+ 

003+ Assert failed:

004+  LONG_MIN-1 ~== round(LONG_MIN - 0.6)

005+ Left:  int(9223372036854775807)

006+ Right: float(-9.2233720368548E+18)

007+ 

008+ Assert failed:

009+  LONG_MIN-1 ~== floor(LONG_MIN - 0.5)

010+ Left:  int(9223372036854775807)

011+ Right: float(-9.2233720368548E+18)

012+ 

013+ Assert failed:

014+  LONG_MAX+1 ~== ceil(LONG_MAX + 0.5)

015+ Left:  int(-9223372036854775808)

016+ Right: float(9.2233720368548E+18)

017+ 

018+ Assert failed:

019+  LONG_MAX+1 ~== round(LONG_MAX + 0.6)

020+ Left:  int(-9223372036854775808)

021+ Right: float(9.2233720368548E+18)
================================================================================



================================================================================
/house/nohn/php-4.3.0RC2/ext/standard/tests/strings/strcspn.phpt
================================================================================

---- EXPECTED OUTPUT
string(25) "22222222aaaa bbb1111 cccc"
string(4) "1234"
int(0)
int(7)
int(6)
---- ACTUAL OUTPUT
string(25) "22222222aaaa bbb1111 cccc"
string(4) "1234"
int(0)
int(0)
int(0)
---- FAILED

================================================================================
004- int(7)

004+ int(0)

005- int(6)

005+ int(0)
================================================================================



================================================================================
/house/nohn/php-4.3.0RC2/ext/standard/tests/strings/strspn.phpt
================================================================================

---- EXPECTED OUTPUT
string(25) "22222222aaaa bbb1111 cccc"
string(4) "1234"
int(8)
int(6)
int(3)
---- ACTUAL OUTPUT
string(25) "22222222aaaa bbb1111 cccc"
string(4) "1234"
---- FAILED

================================================================================
003- int(8)

004- int(6)

005- int(3)
================================================================================



================================================================================
/house/nohn/php-4.3.0RC2/ext/sysvsem/tests/sysv.phpt
================================================================================

---- EXPECTED OUTPUT
Start.
Got semaphore Resource id #%i.
Success aquire semaphore Resource id #%i.
Success to attach shared memory : %i.
Write var1 to shared memory.
Write var2 to shared memory.
Read var1=Variable 1.
Read var2=Variable 2.
Semaphore Resource id #%i released.
Shared memory successfully removed from SysV.
semaphore removed successfully from SysV.
End.
---- ACTUAL OUTPUT
Start.

Warning: semop() failed acquiring SYSVSEM_SETVAL for key 0x1: Permission denied in /house/nohn/php-4.3.0RC2/ext/sysvsem/tests/sysv.php on line 8

Warning: semctl(GETVAL) failed for key 0x1: Permission denied in /house/nohn/php-4.3.0RC2/ext/sysvsem/tests/sysv.php on line 8

Warning: semop() failed releasing SYSVSEM_SETVAL for key 0x1: Permission denied in /house/nohn/php-4.3.0RC2/ext/sysvsem/tests/sysv.php on line 8
Got semaphore Resource id #4.

Warning: semop(acquire) failed for key 0x1: Permission denied in /house/nohn/php-4.3.0RC2/ext/sysvsem/tests/sysv.php on line 16
Fail to aquire semaphore Resource id #4.

Warning: sem_remove() [/phpmanual/function.sem-remove.html]: SysV semphore 4 does not (any longer) exist in /house/nohn/php-4.3.0RC2/ext/sysvsem/tests/sysv.php on line 18

Warning: semop() failed in release_sysvsem_sem for key 0x1: Permission denied in Unknown on line 0
---- FAILED

================================================================================
002- Got semaphore Resource id #%i.

002+ 

003- Success aquire semaphore Resource id #%i.

003+ Warning: semop() failed acquiring SYSVSEM_SETVAL for key 0x1: Permission denied in /house/nohn/php-4.3.0RC2/ext/sysvsem/tests/sysv.php on line 8

004- Success to attach shared memory : %i.

004+ 

005- Write var1 to shared memory.

005+ Warning: semctl(GETVAL) failed for key 0x1: Permission denied in /house/nohn/php-4.3.0RC2/ext/sysvsem/tests/sysv.php on line 8

006- Write var2 to shared memory.

006+ 

007- Read var1=Variable 1.

007+ Warning: semop() failed releasing SYSVSEM_SETVAL for key 0x1: Permission denied in /house/nohn/php-4.3.0RC2/ext/sysvsem/tests/sysv.php on line 8

008- Read var2=Variable 2.

008+ Got semaphore Resource id #4.

009- Semaphore Resource id #%i released.

009+ 

010- Shared memory successfully removed from SysV.

010+ Warning: semop(acquire) failed for key 0x1: Permission denied in /house/nohn/php-4.3.0RC2/ext/sysvsem/tests/sysv.php on line 16

011- semaphore removed successfully from SysV.

011+ Fail to aquire semaphore Resource id #4.

012- End.

012+ 

013+ Warning: sem_remove() [/phpmanual/function.sem-remove.html]: SysV semphore 4 does not (any longer) exist in /house/nohn/php-4.3.0RC2/ext/sysvsem/tests/sysv.php on line 18

014+ 

015+ Warning: semop() failed in release_sysvsem_sem for key 0x1: Permission denied in Unknown on line 0
================================================================================




================================================================================
BUILD ENVIRONMENT
================================================================================
OS:
Linux

Automake:
automake (GNU automake) 1.4-p5

Copyright (C) 1999, 2001 Free Software Foundation, Inc.
This is free software; see the source for copying conditions.  There is NO
warranty; not even for MERCHANTABILITY or FITNESS FOR A PARTICULAR PURPOSE.

Written by Tom Tromey <tromey@cygnus.com>

Autoconf:
Autoconf version 2.13

Libtool:
ltmain.sh (GNU libtool) 1.4 (1.920 2001/04/24 23:26:18)

Compiler:
Reading specs from /usr/lib/gcc-lib/ia64-redhat-linux/2.96/specs
gcc version 2.96 20000731 (Red Hat Linux 7.1 2.96-101)

Bison:
GNU Bison version 1.28




================================================================================
PHPINFO
================================================================================
phpinfo()
PHP Version => 4.3.0RC2

System => Linux spe190 2.4.9-21smp #1 SMP Thu Jan 17 13:10:56 EST 2002 ia64
Build Date => Nov 28 2002 10:04:08
Configure Command =>  './configure' '--enable-bcmath' '--enable-calendar' '--enable-exif' '--enable-ftp' '--enable-shmop' '--enable-sockets' '--enable-sysvmsg' '--enable-sysvsem' '--enable-sysvshm' '--enable-wddx'
Server API => Command Line Interface
Virtual Directory Support => disabled
Configuration File (php.ini) Path => /usr/local/lib
PHP API => 20020918
PHP Extension => 20020429
Zend Extension => 20021010
Debug Build => no
Thread Safety => disabled
Registered PHP Streams => php, http, ftp  


This program makes use of the Zend Scripting Language Engine:
Zend Engine v1.4.0, Copyright (c) 1998-2002 Zend Technologies


 _______________________________________________________________________


Configuration

PHP Core

Directive => Local Value => Master Value
allow_call_time_pass_reference => On => On
allow_url_fopen => On => On
always_populate_raw_post_data => Off => Off
arg_separator.input => &amp; => &amp;
arg_separator.output => &amp; => &amp;
asp_tags => Off => Off
auto_append_file => no value => no value
auto_prepend_file => no value => no value
browscap => no value => no value
default_charset => no value => no value
default_mimetype => text/html => text/html
define_syslog_variables => Off => Off
disable_functions => no value => no value
display_errors => On => On
display_startup_errors => Off => Off
doc_root => no value => no value
docref_ext => no value => no value
docref_root => http://www.php.net/ => http://www.php.net/
enable_dl => On => On
error_append_string => no value => no value
error_log => no value => no value
error_prepend_string => no value => no value
error_reporting => no value => no value
expose_php => On => On
extension_dir => /usr/local/lib/php/extensions/no-debug-non-zts-20020429 => /usr/local/lib/php/extensions/no-debug-non-zts-20020429
file_uploads => On => On
gpc_order => GPC => GPC
highlight.bg => #FFFFFF => #FFFFFF
highlight.comment => #FF8000 => #FF8000
highlight.default => #0000BB => #0000BB
highlight.html => #000000 => #000000
highlight.keyword => #007700 => #007700
highlight.string => #DD0000 => #DD0000
html_errors => Off => On
ignore_repeated_errors => Off => Off
ignore_repeated_source => Off => Off
ignore_user_abort => Off => Off
implicit_flush => On => Off
include_path => .:/usr/local/lib/php => .:/usr/local/lib/php
log_errors => Off => Off
log_errors_max_len => 1024 => 1024
magic_quotes_gpc => On => On
magic_quotes_runtime => Off => Off
magic_quotes_sybase => Off => Off
max_execution_time => 0 => 30
max_input_time => -1 => -1
open_basedir => no value => no value
output_buffering => 0 => 0
output_handler => no value => no value
post_max_size => 8M => 8M
precision => 14 => 14
register_argc_argv => On => On
register_globals => Off => Off
report_memleaks => On => On
safe_mode => Off => Off
safe_mode_exec_dir => 1 => 1
safe_mode_gid => Off => Off
safe_mode_include_dir => no value => no value
sendmail_from => no value => no value
sendmail_path =>  -t -i  =>  -t -i 
short_open_tag => On => On
SMTP => localhost => localhost
smtp_port => 25 => 25
sql.safe_mode => Off => Off
track_errors => Off => Off
unserialize_callback_func => no value => no value
upload_max_filesize => 2M => 2M
upload_tmp_dir => no value => no value
user_dir => no value => no value
variables_order => no value => no value
xmlrpc_error_number => 0 => 0
xmlrpc_errors => Off => Off
y2k_compliance => On => On

bcmath

BCMath support => enabled

calendar

Calendar support => enabled

ctype

ctype functions => enabled

exif

EXIF Support => enabled
EXIF Version => 1.4 $Id: exif.c,v 1.118.2.3 2002/11/27 02:43:21 helly Exp $
Supported EXIF Version => 0220
Supported filetypes => JPEG,TIFF

ftp

FTP support => enabled

mysql

MySQL Support => enabled
Active Persistent Links => 0
Active Links => 0
Client API version => 3.23.49
MYSQL_MODULE_TYPE => builtin
MYSQL_SOCKET => /tmp/mysql.sock
MYSQL_INCLUDE =>  MYSQL_LIBS =>  
Directive => Local Value => Master Value
mysql.allow_persistent => On => On
mysql.connect_timeout => -1 => -1
mysql.default_host => no value => no value
mysql.default_password => no value => no value
mysql.default_port => no value => no value
mysql.default_socket => no value => no value
mysql.default_user => no value => no value
mysql.max_links => Unlimited => Unlimited
mysql.max_persistent => Unlimited => Unlimited
mysql.trace_mode => Off => Off

overload

User-Space Object Overloading Support => enabled

pcre

PCRE (Perl Compatible Regular Expressions) Support => enabled
PCRE Library Version => 3.92 11-Sep-2002

posix

Revision => $Revision: 1.51 $

session

Session Support => enabled
Registered save handlers => files user 

Directive => Local Value => Master Value
session.auto_start => Off => Off
session.bug_compat_42 => On => On
session.bug_compat_warn => On => On
session.cache_expire => 180 => 180
session.cache_limiter => nocache => nocache
session.cookie_domain => no value => no value
session.cookie_lifetime => 0 => 0
session.cookie_path => / => /
session.cookie_secure => Off => Off
session.entropy_file => no value => no value
session.entropy_length => 0 => 0
session.gc_dividend => 100 => 100
session.gc_maxlifetime => 1440 => 1440
session.gc_probability => 1 => 1
session.name => PHPSESSID => PHPSESSID
session.referer_check => no value => no value
session.save_handler => files => files
session.save_path => /tmp => /tmp
session.serialize_handler => php => php
session.use_cookies => On => On
session.use_only_cookies => Off => Off
session.use_trans_sid => Off => Off

shmop

shmop support => enabled

sockets

Sockets Support => enabled

standard

Regex Library => Bundled library enabled
Dynamic Library Support => enabled

Directive => Local Value => Master Value
assert.active => 1 => 1
assert.bail => 0 => 0
assert.callback => no value => no value
assert.quiet_eval => 0 => 0
assert.warning => 1 => 1
auto_detect_line_endings => 0 => 0
default_socket_timeout => 60 => 60
safe_mode_allowed_env_vars => PHP_ => PHP_
safe_mode_protected_env_vars => LD_LIBRARY_PATH => LD_LIBRARY_PATH
url_rewriter.tags => a=href,area=href,frame=src,form=,fieldset= => a=href,area=href,frame=src,form=,fieldset=
user_agent => no value => no value

sysvmsg

sysvmsg support => enabled
Revision => $Revision: 1.4.2.1 $

tokenizer

Tokenizer Support => enabled

wddx

WDDX Support => enabled
WDDX Session Serializer => enabled

xml

XML Support => active
XML Namespace Support => active
EXPAT Version => 1.95.2

Additional Modules

Module Name
sysvsem
sysvshm

Environment

Variable => Value
PWD => /house/nohn/php-4.3.0RC2
MAKEFLAGS =>  SCRIPT_FILENAME =>  VENDOR => unknown
REMOTEHOST => alkoholbedarf.de
MFLAGS =>  HOSTNAME => spe190
LESSOPEN => |/usr/bin/lesspipe.sh %s
CC => gcc
REQUEST_METHOD =>  LS_COLORS => no=00:fi=00:di=01;34:ln=01;36:pi=40;33:so=01;35:bd=40;33;01:cd=40;33;01:or=01;05;37;41:mi=01;05;37;41:ex=01;32:*.cmd=01;32:*.exe=01;32:*.com=01;32:*.btm=01;32:*.bat=01;32:*.sh=01;32:*.csh=01;32:*.tar=01;31:*.tgz=01;31:*.arj=01;31:*.taz=01;31:*.lzh=01;31:*.zip=01;31:*.z=01;31:*.Z=01;31:*.gz=01;31:*.bz2=01;31:*.bz=01;31:*.tz=01;31:*.rpm=01;31:*.cpio=01;31:*.jpg=01;35:*.gif=01;35:*.bmp=01;35:*.xbm=01;35:*.xpm=01;35:*.png=01;35:*.tif=01;35:
USER => nohn
MACHTYPE => unknown
TEST_PHP_SRCDIR => /house/nohn/php-4.3.0RC2
MAIL => /var/mail/nohn
PATH_TRANSLATED =>  LANG => en_US
QUERY_STRING =>  CONTENT_LENGTH =>  HOST => spe190
MAKELEVEL => 1
DISPLAY => p50856bda:0.0
SHLVL => 4
LOGNAME => nohn
GROUP => nis
REDIRECT_STATUS =>  _ => /house/nohn/php-4.3.0RC2/sapi/cli/php
TEST_PHP_EXECUTABLE => /house/nohn/php-4.3.0RC2/sapi/cli/php
SUPPORTED => en_US:en
SHELL => /bin/sh
HOSTTYPE => unknown
OSTYPE => linux
TERM => xterm
HOME => /house/nohn
SSH_ASKPASS => /usr/libexec/openssh/gnome-ssh-askpass
PATH => /house/nohn/bin:/usr/local/bin:/bin:/usr/bin:/usr/X11R6/bin
CONTENT_TYPE =>  
PHP Variables

Variable => Value
_SERVER["PWD"] => /house/nohn/php-4.3.0RC2
_SERVER["MAKEFLAGS"] => 
_SERVER["SCRIPT_FILENAME"] => 
_SERVER["VENDOR"] => unknown
_SERVER["REMOTEHOST"] => alkoholbedarf.de
_SERVER["MFLAGS"] => 
_SERVER["HOSTNAME"] => spe190
_SERVER["LESSOPEN"] => |/usr/bin/lesspipe.sh %s
_SERVER["CC"] => gcc
_SERVER["REQUEST_METHOD"] => 
_SERVER["LS_COLORS"] => no=00:fi=00:di=01;34:ln=01;36:pi=40;33:so=01;35:bd=40;33;01:cd=40;33;01:or=01;05;37;41:mi=01;05;37;41:ex=01;32:*.cmd=01;32:*.exe=01;32:*.com=01;32:*.btm=01;32:*.bat=01;32:*.sh=01;32:*.csh=01;32:*.tar=01;31:*.tgz=01;31:*.arj=01;31:*.taz=01;31:*.lzh=01;31:*.zip=01;31:*.z=01;31:*.Z=01;31:*.gz=01;31:*.bz2=01;31:*.bz=01;31:*.tz=01;31:*.rpm=01;31:*.cpio=01;31:*.jpg=01;35:*.gif=01;35:*.bmp=01;35:*.xbm=01;35:*.xpm=01;35:*.png=01;35:*.tif=01;35:
_SERVER["USER"] => nohn
_SERVER["MACHTYPE"] => unknown
_SERVER["TEST_PHP_SRCDIR"] => /house/nohn/php-4.3.0RC2
_SERVER["MAIL"] => /var/mail/nohn
_SERVER["PATH_TRANSLATED"] => 
_SERVER["LANG"] => en_US
_SERVER["QUERY_STRING"] => 
_SERVER["CONTENT_LENGTH"] => 
_SERVER["HOST"] => spe190
_SERVER["MAKELEVEL"] => 1
_SERVER["DISPLAY"] => p50856bda:0.0
_SERVER["SHLVL"] => 4
_SERVER["LOGNAME"] => nohn
_SERVER["GROUP"] => nis
_SERVER["REDIRECT_STATUS"] => 
_SERVER["_"] => /house/nohn/php-4.3.0RC2/sapi/cli/php
_SERVER["TEST_PHP_EXECUTABLE"] => /house/nohn/php-4.3.0RC2/sapi/cli/php
_SERVER["SUPPORTED"] => en_US:en
_SERVER["SHELL"] => /bin/sh
_SERVER["HOSTTYPE"] => unknown
_SERVER["OSTYPE"] => linux
_SERVER["TERM"] => xterm
_SERVER["HOME"] => /house/nohn
_SERVER["SSH_ASKPASS"] => /usr/libexec/openssh/gnome-ssh-askpass
_SERVER["PATH"] => /house/nohn/bin:/usr/local/bin:/bin:/usr/bin:/usr/X11R6/bin
_SERVER["CONTENT_TYPE"] => 
_SERVER["PHP_SELF"] => 
_SERVER["SCRIPT_NAME"] => 
_SERVER["DOCUMENT_ROOT"] => 
_SERVER["argv"] => Array
(
)

_SERVER["argc"] => 0
_ENV["PWD"] => /house/nohn/php-4.3.0RC2
_ENV["MAKEFLAGS"] => 
_ENV["SCRIPT_FILENAME"] => 
_ENV["VENDOR"] => unknown
_ENV["REMOTEHOST"] => alkoholbedarf.de
_ENV["MFLAGS"] => 
_ENV["HOSTNAME"] => spe190
_ENV["LESSOPEN"] => |/usr/bin/lesspipe.sh %s
_ENV["CC"] => gcc
_ENV["REQUEST_METHOD"] => 
_ENV["LS_COLORS"] => no=00:fi=00:di=01;34:ln=01;36:pi=40;33:so=01;35:bd=40;33;01:cd=40;33;01:or=01;05;37;41:mi=01;05;37;41:ex=01;32:*.cmd=01;32:*.exe=01;32:*.com=01;32:*.btm=01;32:*.bat=01;32:*.sh=01;32:*.csh=01;32:*.tar=01;31:*.tgz=01;31:*.arj=01;31:*.taz=01;31:*.lzh=01;31:*.zip=01;31:*.z=01;31:*.Z=01;31:*.gz=01;31:*.bz2=01;31:*.bz=01;31:*.tz=01;31:*.rpm=01;31:*.cpio=01;31:*.jpg=01;35:*.gif=01;35:*.bmp=01;35:*.xbm=01;35:*.xpm=01;35:*.png=01;35:*.tif=01;35:
_ENV["USER"] => nohn
_ENV["MACHTYPE"] => unknown
_ENV["TEST_PHP_SRCDIR"] => /house/nohn/php-4.3.0RC2
_ENV["MAIL"] => /var/mail/nohn
_ENV["PATH_TRANSLATED"] => 
_ENV["LANG"] => en_US
_ENV["QUERY_STRING"] => 
_ENV["CONTENT_LENGTH"] => 
_ENV["HOST"] => spe190
_ENV["MAKELEVEL"] => 1
_ENV["DISPLAY"] => p50856bda:0.0
_ENV["SHLVL"] => 4
_ENV["LOGNAME"] => nohn
_ENV["GROUP"] => nis
_ENV["REDIRECT_STATUS"] => 
_ENV["_"] => /house/nohn/php-4.3.0RC2/sapi/cli/php
_ENV["TEST_PHP_EXECUTABLE"] => /house/nohn/php-4.3.0RC2/sapi/cli/php
_ENV["SUPPORTED"] => en_US:en
_ENV["SHELL"] => /bin/sh
_ENV["HOSTTYPE"] => unknown
_ENV["OSTYPE"] => linux
_ENV["TERM"] => xterm
_ENV["HOME"] => /house/nohn
_ENV["SSH_ASKPASS"] => /usr/libexec/openssh/gnome-ssh-askpass
_ENV["PATH"] => /house/nohn/bin:/usr/local/bin:/bin:/usr/bin:/usr/X11R6/bin
_ENV["CONTENT_TYPE"] => 

PHP License
This program is free software; you can redistribute it and/or modify
it under the terms of the PHP License as published by the PHP Group
and included in the distribution in the file:  LICENSE

This program is distributed in the hope that it will be useful,
but WITHOUT ANY WARRANTY; without even the implied warranty of
MERCHANTABILITY or FITNESS FOR A PARTICULAR PURPOSE.

If you did not receive a copy of the PHP license, or have any
questions about PHP licensing, please contact license@php.net.
