Test results for 5.3.0alpha3-dev [failed]

From: Date: Mon, 10 Nov 2008 12:35:45 +0000
Subject: Test results for 5.3.0alpha3-dev [failed]
Groups: php.qa.reports 
Request: Send a blank email to php-qa-reports+get-13147@lists.php.net to get a copy of this message
===================================================================== FAILED TEST SUMMARY --------------------------------------------------------------------- Bug #45392 (ob_start()/ob_end_clean() and memory_limit) [tests/lang/bug45392.phpt] Bug #42082 (NodeList length zero should be empty) [ext/dom/tests/bug42082.phpt] iconv stream filter [ext/iconv/tests/iconv_stream_filter.phpt] Bug #41567 (json_encode() double conversion is inconsistent with PHP) [ext/json/tests/bug41567.phpt] mysql connect [ext/mysql/tests/001.phpt] mysql_connect() [ext/mysql/tests/mysql_connect.phpt] mysql_[p]connect() - max_links/max_persistent [ext/mysql/tests/mysql_max_links.phpt] mysql_[p]connect() - safe_mode [ext/mysql/tests/mysql_sql_safe_mode.phpt] unset($_SESSION["name"]); should work [ext/session/tests/027.phpt] Test session_decode() function : basic functionality [ext/session/tests/session_decode_basic.phpt] Test session_decode() function : error functionality [ext/session/tests/session_decode_error2.phpt] Test session_decode() function : variation [ext/session/tests/session_decode_variation1.phpt] Test session_module_name() function : variation [ext/session/tests/session_module_name_variation4.phpt] Test session_register() function : basic functionality [ext/session/tests/session_register_basic.phpt] Test session_register() function : variation [ext/session/tests/session_register_variation1.phpt] Test session_register() function : variation [ext/session/tests/session_register_variation3.phpt] Test session_register() function : variation [ext/session/tests/session_register_variation4.phpt] Test session_set_save_handler() function : basic functionality [ext/session/tests/session_set_save_handler_basic.phpt] Test session_set_save_handler() function : using closures as callbacks [ext/session/tests/session_set_save_handler_closures.phpt] Test session_set_save_handler() function : variation [ext/session/tests/session_set_save_handler_variation4.phpt] Test session_start() function : variation [ext/session/tests/session_start_variation6.phpt] Test session_unregister() function : variation [ext/session/tests/session_unregister_variation1.phpt] Bug #34657 (If you get a communication problem when loading the WSDL, it fatal's) [ext/soap/tests/bugs/bug34657.phpt] Bug #42151 (__destruct functions not called after catching a SoapFault exception) [ext/soap/tests/bugs/bug42151.phpt] SPL: FilesystemIterator and foreach [ext/spl/tests/dit_003.phpt] similar_text(), basic tests [ext/standard/tests/strings/similar_text_basic.phpt] syntax check [sapi/cgi/tests/006.phpt] ===================================================================== ===================================================================== EXPECTED FAILED TEST SUMMARY --------------------------------------------------------------------- Inconsistencies when accessing protected members [Zend/tests/access_modifiers_008.phpt] Inconsistencies when accessing protected members - 2 [Zend/tests/access_modifiers_009.phpt] Test restore_error_handler() function : bug #46196 [Zend/tests/bug46196.phpt] SimpleXML: array casting bug [ext/simplexml/tests/034.phpt] ===================================================================== ===================================================================== TEST RESULT SUMMARY --------------------------------------------------------------------- Exts skipped : 46 Exts tested : 31 --------------------------------------------------------------------- Number of tests : 8052 6216 Tests skipped : 1836 ( 22.8%) -------- Tests warned : 0 ( 0.0%) ( 0.0%) Tests failed : 27 ( 0.3%) ( 0.4%) Expected fail : 4 ( 0.0%) ( 0.1%) Tests passed : 6185 ( 76.8%) ( 99.5%) --------------------------------------------------------------------- Time taken : 703 seconds ===================================================================== ===================================================================== FAILED TEST SUMMARY --------------------------------------------------------------------- Bug #45392 (ob_start()/ob_end_clean() and memory_limit) [tests/lang/bug45392.phpt] Bug #42082 (NodeList length zero should be empty) [ext/dom/tests/bug42082.phpt] iconv stream filter [ext/iconv/tests/iconv_stream_filter.phpt] Bug #41567 (json_encode() double conversion is inconsistent with PHP) [ext/json/tests/bug41567.phpt] mysql connect [ext/mysql/tests/001.phpt] mysql_connect() [ext/mysql/tests/mysql_connect.phpt] mysql_[p]connect() - max_links/max_persistent [ext/mysql/tests/mysql_max_links.phpt] mysql_[p]connect() - safe_mode [ext/mysql/tests/mysql_sql_safe_mode.phpt] unset($_SESSION["name"]); should work [ext/session/tests/027.phpt] Test session_decode() function : basic functionality [ext/session/tests/session_decode_basic.phpt] Test session_decode() function : error functionality [ext/session/tests/session_decode_error2.phpt] Test session_decode() function : variation [ext/session/tests/session_decode_variation1.phpt] Test session_module_name() function : variation [ext/session/tests/session_module_name_variation4.phpt] Test session_register() function : basic functionality [ext/session/tests/session_register_basic.phpt] Test session_register() function : variation [ext/session/tests/session_register_variation1.phpt] Test session_register() function : variation [ext/session/tests/session_register_variation3.phpt] Test session_register() function : variation [ext/session/tests/session_register_variation4.phpt] Test session_set_save_handler() function : basic functionality [ext/session/tests/session_set_save_handler_basic.phpt] Test session_set_save_handler() function : using closures as callbacks [ext/session/tests/session_set_save_handler_closures.phpt] Test session_set_save_handler() function : variation [ext/session/tests/session_set_save_handler_variation4.phpt] Test session_start() function : variation [ext/session/tests/session_start_variation6.phpt] Test session_unregister() function : variation [ext/session/tests/session_unregister_variation1.phpt] Bug #34657 (If you get a communication problem when loading the WSDL, it fatal's) [ext/soap/tests/bugs/bug34657.phpt] Bug #42151 (__destruct functions not called after catching a SoapFault exception) [ext/soap/tests/bugs/bug42151.phpt] SPL: FilesystemIterator and foreach [ext/spl/tests/dit_003.phpt] similar_text(), basic tests [ext/standard/tests/strings/similar_text_basic.phpt] syntax check [sapi/cgi/tests/006.phpt] ===================================================================== ===================================================================== EXPECTED FAILED TEST SUMMARY --------------------------------------------------------------------- Inconsistencies when accessing protected members [Zend/tests/access_modifiers_008.phpt] Inconsistencies when accessing protected members - 2 [Zend/tests/access_modifiers_009.phpt] Test restore_error_handler() function : bug #46196 [Zend/tests/bug46196.phpt] SimpleXML: array casting bug [ext/simplexml/tests/034.phpt] ===================================================================== ================================================================================ /home/lars/src/php/php5.3-200811101130/tests/lang/bug45392.phpt ================================================================================ 2 Fatal error: Allowed memory size of 262144 bytes exhausted (tried to allocate 204801 bytes) in /home/lars/src/php/php5.3-200811101130/tests/lang/bug45392.php on line 9 ================================================================================ 003- 5 ================================================================================ ================================================================================ /home/lars/src/php/php5.3-200811101130/ext/dom/tests/bug42082.phpt ================================================================================ Warning: DOMXPath::query(): Invalid or inclomplete context in /home/lars/src/php/php5.3-200811101130/ext/dom/tests/bug42082.php on line 4 bool(false) Notice: Trying to get property of non-object in /home/lars/src/php/php5.3-200811101130/ext/dom/tests/bug42082.php on line 6 NULL Notice: Trying to get property of non-object in /home/lars/src/php/php5.3-200811101130/ext/dom/tests/bug42082.php on line 7 bool(true) bool(true) string(0) "" bool(true) bool(true) bool(false) bool(false) ================================================================================ 001+ Warning: DOMXPath::query(): Invalid or inclomplete context in /home/lars/src/php/php5.3-200811101130/ext/dom/tests/bug42082.php on line 4 002+ bool(false) 003+ 004+ Notice: Trying to get property of non-object in /home/lars/src/php/php5.3-200811101130/ext/dom/tests/bug42082.php on line 6 005+ NULL 006+ 007+ Notice: Trying to get property of non-object in /home/lars/src/php/php5.3-200811101130/ext/dom/tests/bug42082.php on line 7 001- object(DOMNodeList)#%d (0) { 002- } 003- int(0) ================================================================================ ================================================================================ /home/lars/src/php/php5.3-200811101130/ext/iconv/tests/iconv_stream_filter.phpt ================================================================================ string(20) "1b244224332473244b24" string(10) "41244f1b28" string(2) "42" string(20) "a4b3a4f3a4cba4c1a4cf" string(10) "69636f6e76" string(2) "0a" string(20) "1b244f24332466245824" string(10) "4e24421b28" string(2) "4f" ================================================================================ 007+ string(20) "1b244f24332466245824" 008+ string(10) "4e24421b28" 009+ string(2) "4f" 007- 008- Warning: fread(): iconv stream filter ("ISO-2022-JP"=>"EUC-JP"): invalid multibyte sequence in %s on line %d 009- string(0) "" 010- string(0) "" 011- string(0) "" ================================================================================ ================================================================================ /home/lars/src/php/php5.3-200811101130/ext/json/tests/bug41567.phpt ================================================================================ float(123456789.123) Done ================================================================================ 001+ float(123456789.123) 001- float(123456789.12345) ================================================================================ ================================================================================ /home/lars/src/php/php5.3-200811101130/ext/mysql/tests/001.phpt ================================================================================ Warning: mysql_connect(): Access denied for user: 'root@localhost' (Using password: NO) in /home/lars/src/php/php5.3-200811101130/ext/mysql/tests/001.php on line 11 Warning: mysql_close(): supplied argument is not a valid MySQL-Link resource in /home/lars/src/php/php5.3-200811101130/ext/mysql/tests/001.php on line 13 Warning: mysql_connect(): Access denied for user: 'root@localhost' (Using password: NO) in /home/lars/src/php/php5.3-200811101130/ext/mysql/tests/001.php on line 16 Warning: mysql_close(): supplied argument is not a valid MySQL-Link resource in /home/lars/src/php/php5.3-200811101130/ext/mysql/tests/001.php on line 18 string(2) "00" done! ================================================================================ 001+ Warning: mysql_connect(): Access denied for user: 'root@localhost' (Using password: NO) in /home/lars/src/php/php5.3-200811101130/ext/mysql/tests/001.php on line 11 002+ 003+ Warning: mysql_close(): supplied argument is not a valid MySQL-Link resource in /home/lars/src/php/php5.3-200811101130/ext/mysql/tests/001.php on line 13 004+ 005+ Warning: mysql_connect(): Access denied for user: 'root@localhost' (Using password: NO) in /home/lars/src/php/php5.3-200811101130/ext/mysql/tests/001.php on line 16 006+ 007+ Warning: mysql_close(): supplied argument is not a valid MySQL-Link resource in /home/lars/src/php/php5.3-200811101130/ext/mysql/tests/001.php on line 18 008+ string(2) "00" 001- string(2) "11" ================================================================================ ================================================================================ /home/lars/src/php/php5.3-200811101130/ext/mysql/tests/mysql_connect.phpt ================================================================================ Warning: mysql_connect(): Access denied for user: 'root@localhost' (Using password: NO) in /home/lars/src/php/php5.3-200811101130/ext/mysql/tests/mysql_connect.php on line 12 [002] Cannot connect to the server using host=localhost/localhost:3306, user=root, passwd=***, dbname=test, port=3306, socket= Warning: mysql_close(): supplied argument is not a valid MySQL-Link resource in /home/lars/src/php/php5.3-200811101130/ext/mysql/tests/mysql_connect.php on line 16 Warning: mysql_connect(): Access denied for user: 'rootunknown_real@localhost' (Using password: YES) in /home/lars/src/php/php5.3-200811101130/ext/mysql/tests/mysql_connect.php on line 18 Warning: mysql_connect(): Access denied for user: 'root@localhost' (Using password: NO) in /home/lars/src/php/php5.3-200811101130/ext/mysql/tests/mysql_connect.php on line 27 [005] Usage of mysql.default_socket failed Warning: mysql_connect(): Access denied for user: 'root@localhost' (Using password: NO) in /home/lars/src/php/php5.3-200811101130/ext/mysql/tests/mysql_connect.php on line 36 [006] Usage of mysql.default_port failed Warning: mysql_connect(): Access denied for user: 'root@localhost' (Using password: NO) in /home/lars/src/php/php5.3-200811101130/ext/mysql/tests/mysql_connect.php on line 43 [007] Usage of mysql.default_password failed Warning: mysql_connect(): Access denied for user: 'root@localhost' (Using password: NO) in /home/lars/src/php/php5.3-200811101130/ext/mysql/tests/mysql_connect.php on line 49 [008] Usage of mysql.default_user failed Warning: mysql_connect(): Access denied for user: 'root@localhost' (Using password: NO) in /home/lars/src/php/php5.3-200811101130/ext/mysql/tests/mysql_connect.php on line 56 [009] Usage of mysql.default_host failed Warning: mysql_connect(): Access denied for user: 'root@localhost' (Using password: NO) in /home/lars/src/php/php5.3-200811101130/ext/mysql/tests/mysql_connect.php on line 65 [010] Usage of env MYSQL_TCP_PORT failed Warning: mysql_connect(): Access denied for user: 'root@localhost' (Using password: NO) in /home/lars/src/php/php5.3-200811101130/ext/mysql/tests/mysql_connect.php on line 81 Warning: mysql_connect(): Access denied for user: 'root@localhost' (Using password: NO) in /home/lars/src/php/php5.3-200811101130/ext/mysql/tests/mysql_connect.php on line 86 done! ================================================================================ 001+ Warning: mysql_connect(): Access denied for user: 'root@localhost' (Using password: NO) in /home/lars/src/php/php5.3-200811101130/ext/mysql/tests/mysql_connect.php on line 12 002+ [002] Cannot connect to the server using host=localhost/localhost:3306, user=root, passwd=***, dbname=test, port=3306, socket= 001- Warning: mysql_connect(): Access denied for user '%s'@'%s' (using password: YES) in %s on line %d 002- done! 003+ 004+ Warning: mysql_close(): supplied argument is not a valid MySQL-Link resource in /home/lars/src/php/php5.3-200811101130/ext/mysql/tests/mysql_connect.php on line 16 005+ 006+ Warning: mysql_connect(): Access denied for user: 'rootunknown_real@localhost' (Using password: YES) in /home/lars/src/php/php5.3-200811101130/ext/mysql/tests/mysql_connect.php on line 18 007+ 008+ Warning: mysql_connect(): Access denied for user: 'root@localhost' (Using password: NO) in /home/lars/src/php/php5.3-200811101130/ext/mysql/tests/mysql_connect.php on line 27 009+ [005] Usage of mysql.default_socket failed 010+ 011+ Warning: mysql_connect(): Access denied for user: 'root@localhost' (Using password: NO) in /home/lars/src/php/php5.3-200811101130/ext/mysql/tests/mysql_connect.php on line 36 012+ [006] Usage of mysql.default_port failed 013+ 014+ Warning: mysql_connect(): Access denied for user: 'root@localhost' (Using password: NO) in /home/lars/src/php/php5.3-200811101130/ext/mysql/tests/mysql_connect.php on line 43 015+ [007] Usage of mysql.default_password failed 016+ 017+ Warning: mysql_connect(): Access denied for user: 'root@localhost' (Using password: NO) in /home/lars/src/php/php5.3-200811101130/ext/mysql/tests/mysql_connect.php on line 49 018+ [008] Usage of mysql.default_user failed 019+ 020+ Warning: mysql_connect(): Access denied for user: 'root@localhost' (Using password: NO) in /home/lars/src/php/php5.3-200811101130/ext/mysql/tests/mysql_connect.php on line 56 021+ [009] Usage of mysql.default_host failed 022+ 023+ Warning: mysql_connect(): Access denied for user: 'root@localhost' (Using password: NO) in /home/lars/src/php/php5.3-200811101130/ext/mysql/tests/mysql_connect.php on line 65 024+ [010] Usage of env MYSQL_TCP_PORT failed 025+ 026+ Warning: mysql_connect(): Access denied for user: 'root@localhost' (Using password: NO) in /home/lars/src/php/php5.3-200811101130/ext/mysql/tests/mysql_connect.php on line 81 027+ 028+ Warning: mysql_connect(): Access denied for user: 'root@localhost' (Using password: NO) in /home/lars/src/php/php5.3-200811101130/ext/mysql/tests/mysql_connect.php on line 86 029+ done! ================================================================================ ================================================================================ /home/lars/src/php/php5.3-200811101130/ext/mysql/tests/mysql_max_links.phpt ================================================================================ Warning: mysql_connect(): Access denied for user: 'root@localhost' (Using password: NO) in /home/lars/src/php/php5.3-200811101130/ext/mysql/tests/mysql_max_links.php on line 10 [010] Cannot connect using host 'localhost:3306', user 'root', password '****', [0] 1045 Warning: mysql_connect(): Access denied for user: 'root@localhost' (Using password: NO) in /home/lars/src/php/php5.3-200811101130/ext/mysql/tests/mysql_max_links.php on line 10 [020] Cannot connect using host 'localhost:3306', user 'root', password '****', [0] 1045 Warning: mysql_connect(): Access denied for user: 'root@localhost' (Using password: NO) in /home/lars/src/php/php5.3-200811101130/ext/mysql/tests/mysql_max_links.php on line 10 [030] Cannot connect using host 'localhost:3306', user 'root', password '****', [0] 1045 Warning: mysql_close(): supplied argument is not a valid MySQL-Link resource in /home/lars/src/php/php5.3-200811101130/ext/mysql/tests/mysql_max_links.php on line 33 Warning: mysql_connect(): Access denied for user: 'root@localhost' (Using password: NO) in /home/lars/src/php/php5.3-200811101130/ext/mysql/tests/mysql_max_links.php on line 10 [050] Cannot connect using host 'localhost:3306', user 'root', password '****', [0] 1045 Warning: mysql_connect(): Access denied for user: 'root@localhost' (Using password: NO) in /home/lars/src/php/php5.3-200811101130/ext/mysql/tests/mysql_max_links.php on line 10 [060] Cannot connect using host 'localhost:3306', user 'root', password '****', [0] 1045 array(3) { [0]=> bool(false) [1]=> bool(false) [2]=> bool(false) } Warning: mysql_close(): supplied argument is not a valid MySQL-Link resource in /home/lars/src/php/php5.3-200811101130/ext/mysql/tests/mysql_max_links.php on line 42 Warning: mysql_close(): supplied argument is not a valid MySQL-Link resource in /home/lars/src/php/php5.3-200811101130/ext/mysql/tests/mysql_max_links.php on line 43 done! ================================================================================ 001+ Warning: mysql_connect(): Access denied for user: 'root@localhost' (Using password: NO) in /home/lars/src/php/php5.3-200811101130/ext/mysql/tests/mysql_max_links.php on line 10 002+ [010] Cannot connect using host 'localhost:3306', user 'root', password '****', [0] 1045 003+ 004+ Warning: mysql_connect(): Access denied for user: 'root@localhost' (Using password: NO) in /home/lars/src/php/php5.3-200811101130/ext/mysql/tests/mysql_max_links.php on line 10 005+ [020] Cannot connect using host 'localhost:3306', user 'root', password '****', [0] 1045 006+ 007+ Warning: mysql_connect(): Access denied for user: 'root@localhost' (Using password: NO) in /home/lars/src/php/php5.3-200811101130/ext/mysql/tests/mysql_max_links.php on line 10 008+ [030] Cannot connect using host 'localhost:3306', user 'root', password '****', [0] 1045 009+ 010+ Warning: mysql_close(): supplied argument is not a valid MySQL-Link resource in /home/lars/src/php/php5.3-200811101130/ext/mysql/tests/mysql_max_links.php on line 33 011+ 012+ Warning: mysql_connect(): Access denied for user: 'root@localhost' (Using password: NO) in /home/lars/src/php/php5.3-200811101130/ext/mysql/tests/mysql_max_links.php on line 10 013+ [050] Cannot connect using host 'localhost:3306', user 'root', password '****', [0] 1045 001- Warning: mysql_connect(): Too many open links (2) in %s on line %s 002- [030] Cannot connect using host '%s', user '%s', password '****', [0] 0 004- Warning: mysql_connect(): Too many open links (2) in %s on line %s 005- [060] Cannot connect using host '%s', user '%s', password '****', [0] 0 008- resource(%d) of type (mysql link) 010- resource(%d) of type (mysql link) 015+ Warning: mysql_connect(): Access denied for user: 'root@localhost' (Using password: NO) in /home/lars/src/php/php5.3-200811101130/ext/mysql/tests/mysql_max_links.php on line 10 016+ [060] Cannot connect using host 'localhost:3306', user 'root', password '****', [0] 1045 019+ bool(false) 021+ bool(false) 025+ 026+ Warning: mysql_close(): supplied argument is not a valid MySQL-Link resource in /home/lars/src/php/php5.3-200811101130/ext/mysql/tests/mysql_max_links.php on line 42 027+ 028+ Warning: mysql_close(): supplied argument is not a valid MySQL-Link resource in /home/lars/src/php/php5.3-200811101130/ext/mysql/tests/mysql_max_links.php on line 43 ================================================================================ ================================================================================ /home/lars/src/php/php5.3-200811101130/ext/mysql/tests/mysql_sql_safe_mode.phpt ================================================================================ Notice: mysql_connect(): SQL safe mode in effect - ignoring host/user/password information in /home/lars/src/php/php5.3-200811101130/ext/mysql/tests/mysql_sql_safe_mode.php on line 8 Warning: mysql_connect(): Access denied for user: 'lars@localhost' (Using password: NO) in /home/lars/src/php/php5.3-200811101130/ext/mysql/tests/mysql_sql_safe_mode.php on line 8 Notice: mysql_pconnect(): SQL safe mode in effect - ignoring host/user/password information in /home/lars/src/php/php5.3-200811101130/ext/mysql/tests/mysql_sql_safe_mode.php on line 13 Warning: mysql_pconnect(): Access denied for user: 'lars@localhost' (Using password: NO) in /home/lars/src/php/php5.3-200811101130/ext/mysql/tests/mysql_sql_safe_mode.php on line 13 done! ================================================================================ 003+ Warning: mysql_connect(): Access denied for user: 'lars@localhost' (Using password: NO) in /home/lars/src/php/php5.3-200811101130/ext/mysql/tests/mysql_sql_safe_mode.php on line 8 003- Warning: mysql_connect(): Access denied for user '%s'@'%s' (using password: NO) in %s on line %d 007+ Warning: mysql_pconnect(): Access denied for user: 'lars@localhost' (Using password: NO) in /home/lars/src/php/php5.3-200811101130/ext/mysql/tests/mysql_sql_safe_mode.php on line 13 007- Warning: mysql_pconnect(): Access denied for user '%s'@'%s' (using password: NO) in %s on line %d ================================================================================ ================================================================================ /home/lars/src/php/php5.3-200811101130/ext/session/tests/027.phpt ================================================================================ array(0) { } array(1) { ["name"]=> string(3) "foo" } array(1) { ["name"]=> &string(3) "foo" } array(0) { } array(0) { } ================================================================================ 009+ &string(3) "foo" 009- string(3) "foo" ================================================================================ ================================================================================ /home/lars/src/php/php5.3-200811101130/ext/session/tests/session_decode_basic.phpt ================================================================================ *** Testing session_decode() : basic functionality *** bool(true) -- Iteration 1 -- bool(true) array(1) { ["data"]=> &int(0) } -- Iteration 2 -- bool(true) array(1) { ["data"]=> int(1) } -- Iteration 3 -- bool(true) array(1) { ["data"]=> &int(12345) } -- Iteration 4 -- bool(true) array(1) { ["data"]=> int(-2345) } -- Iteration 5 -- bool(true) array(1) { ["data"]=> &float(10.5) } -- Iteration 6 -- bool(true) array(1) { ["data"]=> float(-10.5) } -- Iteration 7 -- bool(true) array(1) { ["data"]=> &float(123456789000) } -- Iteration 8 -- bool(true) array(1) { ["data"]=> float(1.23456789E-9) } -- Iteration 9 -- bool(true) array(1) { ["data"]=> &float(0.5) } -- Iteration 10 -- bool(true) array(1) { ["data"]=> NULL } -- Iteration 11 -- bool(true) array(1) { ["data"]=> &NULL } -- Iteration 12 -- bool(true) array(1) { ["data"]=> bool(true) } -- Iteration 13 -- bool(true) array(1) { ["data"]=> &bool(false) } -- Iteration 14 -- bool(true) array(1) { ["data"]=> bool(true) } -- Iteration 15 -- bool(true) array(1) { ["data"]=> &bool(false) } -- Iteration 16 -- bool(true) array(1) { ["data"]=> string(0) "" } -- Iteration 17 -- bool(true) array(1) { ["data"]=> &string(0) "" } -- Iteration 18 -- bool(true) array(1) { ["data"]=> string(7) "Nothing" } -- Iteration 19 -- bool(true) array(1) { ["data"]=> &string(7) "Nothing" } -- Iteration 20 -- bool(true) array(1) { ["data"]=> string(12) "Hello World!" } -- Iteration 21 -- bool(true) array(1) { ["data"]=> &object(classA)#2 (0) { } } -- Iteration 22 -- bool(true) array(1) { ["data"]=> NULL } -- Iteration 23 -- bool(true) array(1) { ["data"]=> &NULL } -- Iteration 24 -- bool(true) array(1) { ["data"]=> int(0) } bool(true) Done ================================================================================ 008+ &int(0) 008- int(0) 022+ &int(12345) 022- int(12345) 036+ &float(10.5) 036- float(10.5) 050+ &float(123456789000) 050- float(123456789000) 064+ &float(0.5) 064- float(0.5) 078+ &NULL 078- NULL 092+ &bool(false) 092- bool(false) 106+ &bool(false) 106- bool(false) 120+ &string(0) "" 120- string(0) "" 134+ &string(7) "Nothing" 134- string(7) "Nothing" 148+ &object(classA)#2 (0) { 148- object(classA)#2 (0) { 163+ &NULL 163- NULL ================================================================================ ================================================================================ /home/lars/src/php/php5.3-200811101130/ext/session/tests/session_decode_error2.phpt ================================================================================ *** Testing session_decode() : error functionality *** bool(true) -- Iteration 0 -- bool(true) array(0) { } -- Iteration 1 -- bool(true) array(0) { } -- Iteration 2 -- bool(true) array(0) { } -- Iteration 3 -- bool(true) array(0) { } -- Iteration 4 -- bool(true) array(1) { ["foo"]=> &NULL } -- Iteration 5 -- bool(true) array(1) { ["foo"]=> &NULL } -- Iteration 6 -- bool(true) array(1) { ["foo"]=> &NULL } -- Iteration 7 -- bool(true) array(1) { ["foo"]=> &NULL } -- Iteration 8 -- bool(true) array(1) { ["foo"]=> &NULL } -- Iteration 9 -- bool(true) array(1) { ["foo"]=> &NULL } -- Iteration 10 -- bool(true) array(1) { ["foo"]=> &NULL } -- Iteration 11 -- bool(true) array(1) { ["foo"]=> &NULL } -- Iteration 12 -- bool(true) array(1) { ["foo"]=> &NULL } -- Iteration 13 -- bool(true) array(1) { ["foo"]=> &NULL } -- Iteration 14 -- bool(true) array(1) { ["foo"]=> &NULL } -- Iteration 15 -- bool(true) array(1) { ["foo"]=> &NULL } -- Iteration 16 -- bool(true) array(1) { ["foo"]=> &NULL } -- Iteration 17 -- bool(true) array(1) { ["foo"]=> &NULL } -- Iteration 18 -- bool(true) array(1) { ["foo"]=> &NULL } -- Iteration 19 -- bool(true) array(1) { ["foo"]=> &NULL } -- Iteration 20 -- bool(true) array(1) { ["foo"]=> &NULL } -- Iteration 21 -- bool(true) array(1) { ["foo"]=> &NULL } -- Iteration 22 -- bool(true) array(1) { ["foo"]=> &NULL } -- Iteration 23 -- bool(true) array(1) { ["foo"]=> &NULL } -- Iteration 24 -- bool(true) array(1) { ["foo"]=> &NULL } -- Iteration 25 -- bool(true) array(1) { ["foo"]=> &NULL } -- Iteration 26 -- bool(true) array(1) { ["foo"]=> &NULL } -- Iteration 27 -- bool(true) array(1) { ["foo"]=> &NULL } -- Iteration 28 -- bool(true) array(1) { ["foo"]=> &NULL } -- Iteration 29 -- bool(true) array(1) { ["foo"]=> &NULL } -- Iteration 30 -- bool(true) array(1) { ["foo"]=> &NULL } -- Iteration 31 -- bool(true) array(1) { ["foo"]=> &NULL } -- Iteration 32 -- bool(true) array(1) { ["foo"]=> &NULL } -- Iteration 33 -- bool(true) array(1) { ["foo"]=> &NULL } -- Iteration 34 -- bool(true) array(1) { ["foo"]=> array(3) { [0]=> int(1) [1]=> int(2) [2]=> int(3) } } -- Iteration 35 -- bool(true) array(1) { ["foo"]=> &array(3) { [0]=> int(1) [1]=> int(2) [2]=> int(3) } } -- Iteration 36 -- bool(true) array(1) { ["foo"]=> array(3) { [0]=> int(1) [1]=> int(2) [2]=> int(3) } } -- Iteration 37 -- bool(true) array(1) { ["foo"]=> &array(3) { [0]=> int(1) [1]=> int(2) [2]=> int(3) } } -- Iteration 38 -- bool(true) array(1) { ["foo"]=> array(3) { [0]=> int(1) [1]=> int(2) [2]=> int(3) } } -- Iteration 39 -- bool(true) array(2) { ["foo"]=> &array(3) { [0]=> int(1) [1]=> int(2) [2]=> int(3) } ["guff"]=> &NULL } -- Iteration 40 -- bool(true) array(2) { ["foo"]=> array(3) { [0]=> int(1) [1]=> int(2) [2]=> int(3) } ["guff"]=> &NULL } -- Iteration 41 -- bool(true) array(2) { ["foo"]=> &array(3) { [0]=> int(1) [1]=> int(2) [2]=> int(3) } ["guff"]=> &NULL } -- Iteration 42 -- bool(true) array(2) { ["foo"]=> array(3) { [0]=> int(1) [1]=> int(2) [2]=> int(3) } ["guff"]=> &NULL } -- Iteration 43 -- bool(true) array(2) { ["foo"]=> &array(3) { [0]=> int(1) [1]=> int(2) [2]=> int(3) } ["guff"]=> array(3) { [0]=> int(1) [1]=> int(2) [2]=> int(3) } } -- Iteration 44 -- bool(true) array(2) { ["foo"]=> &array(3) { [0]=> int(1) [1]=> int(2) [2]=> int(3) } ["guff"]=> &array(3) { [0]=> int(1) [1]=> int(2) [2]=> int(3) } } -- Iteration 45 -- bool(true) array(2) { ["foo"]=> &array(3) { [0]=> int(1) [1]=> int(2) [2]=> int(3) } ["guff"]=> array(3) { [0]=> int(1) [1]=> int(2) [2]=> int(3) } } -- Iteration 46 -- bool(true) array(2) { ["foo"]=> &array(3) { [0]=> int(1) [1]=> int(2) [2]=> int(3) } ["guff"]=> &array(3) { [0]=> int(1) [1]=> int(2) [2]=> int(3) } } -- Iteration 47 -- bool(true) array(2) { ["foo"]=> &array(3) { [0]=> int(1) [1]=> int(2) [2]=> int(3) } ["guff"]=> array(3) { [0]=> int(1) [1]=> int(2) [2]=> int(3) } } -- Iteration 48 -- bool(true) array(3) { ["foo"]=> &array(3) { [0]=> int(1) [1]=> int(2) [2]=> int(3) } ["guff"]=> &array(3) { [0]=> int(1) [1]=> int(2) [2]=> int(3) } ["blah"]=> &NULL } -- Iteration 49 -- bool(true) array(3) { ["foo"]=> &array(3) { [0]=> int(1) [1]=> int(2) [2]=> int(3) } ["guff"]=> array(3) { [0]=> int(1) [1]=> int(2) [2]=> int(3) } ["blah"]=> &NULL } -- Iteration 50 -- bool(true) array(3) { ["foo"]=> &array(3) { [0]=> int(1) [1]=> int(2) [2]=> int(3) } ["guff"]=> &array(3) { [0]=> int(1) [1]=> int(2) [2]=> int(3) } ["blah"]=> &NULL } -- Iteration 51 -- bool(true) array(3) { ["foo"]=> &array(3) { [0]=> int(1) [1]=> int(2) [2]=> int(3) } ["guff"]=> array(3) { [0]=> int(1) [1]=> int(2) [2]=> int(3) } ["blah"]=> &NULL } bool(true) Done ================================================================================ 028+ &NULL 028- NULL 035+ &NULL 035- NULL 042+ &NULL 042- NULL 049+ &NULL 049- NULL 056+ &NULL 056- NULL 063+ &NULL 063- NULL 070+ &NULL 070- NULL 077+ &NULL 077- NULL 084+ &NULL 084- NULL 091+ &NULL 091- NULL 098+ &NULL 098- NULL 105+ &NULL 105- NULL 112+ &NULL 112- NULL 119+ &NULL 119- NULL 126+ &NULL 126- NULL 133+ &NULL 133- NULL 140+ &NULL 140- NULL 147+ &NULL 147- NULL 154+ &NULL 154- NULL 161+ &NULL 161- NULL 168+ &NULL 168- NULL 175+ &NULL 175- NULL 182+ &NULL 182- NULL 189+ &NULL 189- NULL 196+ &NULL 196- NULL 203+ &NULL 203- NULL 210+ &NULL 210- NULL 217+ &NULL 217- NULL 224+ &NULL 224- NULL 231+ &NULL 231- NULL 252+ &array(3) { 252- array(3) { 280+ &array(3) { 280- array(3) { 308+ &array(3) { 308- array(3) { 317+ &NULL 317- NULL 333+ &NULL 333- NULL 340+ &array(3) { 340- array(3) { 349+ &NULL 349- NULL 365+ &NULL 365- NULL 381+ array(3) { 381- &array(3) { 427+ array(3) { 427- &array(3) { 473+ array(3) { 473- &array(3) { 505+ &NULL 505- NULL 521+ array(3) { 521- &array(3) { 530+ &NULL 530- NULL 555+ &NULL 555- NULL 571+ array(3) { 571- &array(3) { 580+ &NULL 580- NULL ================================================================================ ================================================================================ /home/lars/src/php/php5.3-200811101130/ext/session/tests/session_decode_variation1.phpt ================================================================================ *** Testing session_decode() : variation *** bool(true) bool(true) array(3) { ["foo"]=> &array(3) { [0]=> int(1) [1]=> int(2) [2]=> int(3) } ["guff"]=> &array(3) { [0]=> int(1) [1]=> int(2) [2]=> int(3) } ["blah"]=> &array(3) { [0]=> int(1) [1]=> int(2) [2]=> int(3) } } bool(true) array(3) { ["foo"]=> &array(0) { } ["guff"]=> &array(0) { } ["blah"]=> &array(0) { } } bool(true) array(3) { ["foo"]=> &array(0) { } ["guff"]=> &array(0) { } ["blah"]=> &array(0) { } } bool(true) array(3) { ["foo"]=> &array(0) { } ["guff"]=> &array(0) { } ["blah"]=> &array(0) { } } bool(true) array(3) { ["foo"]=> &array(0) { } ["guff"]=> &array(0) { } ["blah"]=> &array(0) { } } bool(true) Done ================================================================================ 036+ &array(0) { 036- &array(3) { 037- [0]=> 038- int(1) 039- [1]=> 040- int(2) 041- [2]=> 042- int(3) 039+ &array(0) { 042+ &array(0) { 045- &array(3) { 046- [0]=> 047- int(1) 048- [1]=> 049- int(2) 050- [2]=> 051- int(3) 048+ &array(0) { 051+ &array(0) { 054+ &array(0) { 054- &array(3) { 055- [0]=> 056- int(1) 057- [1]=> 058- int(2) 059- [2]=> 060- int(3) 060+ &array(0) { 063+ &array(0) { 066+ &array(0) { 066- &array(3) { 067- [0]=> 068- int(1) 069- [1]=> 070- int(2) 071- [2]=> 072- int(3) 072+ &array(0) { 075+ &array(0) { 075- &array(3) { 076- [0]=> 077- int(1) 078- [1]=> 079- int(2) 080- [2]=> 081- int(3) 078+ &array(0) { 084- &array(3) { 085- [0]=> 086- int(1) 087- [1]=> 088- int(2) 089- [2]=> 090- int(3) 096- &array(3) { 097- [0]=> 098- int(1) 099- [1]=> 100- int(2) 101- [2]=> 102- int(3) 105- &array(3) { 106- [0]=> 107- int(1) 108- [1]=> 109- int(2) 110- [2]=> 111- int(3) 114- &array(3) { 115- [0]=> 116- int(1) 117- [1]=> 118- int(2) 119- [2]=> 120- int(3) 126- &array(3) { 127- [0]=> 128- int(1) 129- [1]=> 130- int(2) 131- [2]=> 132- int(3) 135- &array(3) { 136- [0]=> 137- int(1) 138- [1]=> 139- int(2) 140- [2]=> 141- int(3) 144- &array(3) { 145- [0]=> 146- int(1) 147- [1]=> 148- int(2) 149- [2]=> 150- int(3) ================================================================================ ================================================================================ /home/lars/src/php/php5.3-200811101130/ext/session/tests/session_module_name_variation4.phpt ================================================================================ *** Testing session_module_name() : variation *** array(3) { ["Blah"]=> string(12) "Hello World!" ["Foo"]=> bool(false) ["Guff"]=> int(1234567890) } NULL array(3) { ["Blah"]=> &string(12) "Hello World!" ["Foo"]=> &bool(false) ["Guff"]=> &int(1234567890) } bool(true) array(0) { } bool(true) ================================================================================ 014+ &string(12) "Hello World!" 014- string(12) "Hello World!" 016+ &bool(false) 016- bool(false) 018+ &int(1234567890) 018- int(1234567890) ================================================================================ ================================================================================ /home/lars/src/php/php5.3-200811101130/ext/session/tests/session_register_basic.phpt ================================================================================ *** Testing session_register() : basic functionality *** -- Iteration 1 -- bool(true) bool(true) array(1) { ["0"]=> &NULL } bool(true) -- Iteration 2 -- bool(true) bool(true) array(1) { ["1"]=> &NULL } bool(true) -- Iteration 3 -- bool(true) bool(true) array(1) { ["12345"]=> &NULL } bool(true) -- Iteration 4 -- bool(true) bool(true) array(1) { ["-2345"]=> &NULL } bool(true) -- Iteration 5 -- bool(true) bool(true) array(1) { ["10.5"]=> &NULL } bool(true) -- Iteration 6 -- bool(true) bool(true) array(1) { ["-10.5"]=> &NULL } bool(true) -- Iteration 7 -- bool(true) bool(true) array(1) { ["123456789000"]=> &NULL } bool(true) -- Iteration 8 -- bool(true) bool(true) array(1) { ["1.23456789E-9"]=> &NULL } bool(true) -- Iteration 9 -- bool(true) bool(true) array(1) { ["0.5"]=> &NULL } bool(true) -- Iteration 10 -- bool(true) bool(true) array(1) { [""]=> &NULL } bool(true) -- Iteration 11 -- bool(true) bool(true) array(1) { [""]=> &NULL } bool(true) -- Iteration 12 -- bool(true) bool(true) array(1) { ["1"]=> &NULL } bool(true) -- Iteration 13 -- bool(true) bool(true) array(1) { [""]=> &NULL } bool(true) -- Iteration 14 -- bool(true) bool(true) array(1) { ["1"]=> &NULL } bool(true) -- Iteration 15 -- bool(true) bool(true) array(1) { [""]=> &NULL } bool(true) -- Iteration 16 -- bool(true) bool(true) array(1) { [""]=> &NULL } bool(true) -- Iteration 17 -- bool(true) bool(true) array(1) { [""]=> &NULL } bool(true) -- Iteration 18 -- bool(true) bool(true) array(1) { ["Nothing"]=> &NULL } bool(true) -- Iteration 19 -- bool(true) bool(true) array(1) { ["Nothing"]=> &NULL } bool(true) -- Iteration 20 -- bool(true) bool(true) array(1) { ["Hello World!"]=> &NULL } bool(true) -- Iteration 21 -- bool(true) bool(true) array(1) { ["Hello World!"]=> &NULL } bool(true) -- Iteration 22 -- bool(true) bool(true) array(1) { [""]=> &NULL } bool(true) -- Iteration 23 -- bool(true) bool(true) array(1) { [""]=> &NULL } bool(true) -- Iteration 24 -- bool(true) bool(true) array(1) { ["Resource id #5"]=> &NULL } bool(true) Done ================================================================================ 008+ &NULL 008- NULL 017+ &NULL 017- NULL 026+ &NULL 026- NULL 035+ &NULL 035- NULL 044+ &NULL 044- NULL 053+ &NULL 053- NULL 062+ &NULL 062- NULL 071+ &NULL 071- NULL 080+ &NULL 080- NULL 089+ &NULL 089- NULL 098+ &NULL 098- NULL 107+ &NULL 107- NULL 116+ &NULL 116- NULL 125+ &NULL 125- NULL 134+ &NULL 134- NULL 143+ &NULL 143- NULL 152+ &NULL 152- NULL 161+ &NULL 161- NULL 170+ &NULL 170- NULL 179+ &NULL 179- NULL 188+ &NULL 188- NULL 197+ &NULL 197- NULL 206+ &NULL 206- NULL 215+ &NULL 215- NULL ================================================================================ ================================================================================ /home/lars/src/php/php5.3-200811101130/ext/session/tests/session_register_variation1.phpt ================================================================================ *** Testing session_register() : variation *** bool(true) array(0) { } bool(true) array(13) { ["0"]=> &NULL ["1"]=> &NULL ["12345"]=> &NULL ["-2345"]=> &NULL ["10.5"]=> &NULL ["-10.5"]=> &NULL ["123456789000"]=> &NULL ["1.23456789E-9"]=> &NULL ["0.5"]=> &NULL [""]=> &NULL ["Nothing"]=> &NULL ["Hello World!"]=> &NULL ["Resource id #5"]=> &NULL } bool(true) array(13) { ["0"]=> &NULL ["1"]=> &NULL ["12345"]=> &NULL ["-2345"]=> &NULL ["10.5"]=> &NULL ["-10.5"]=> &NULL ["123456789000"]=> &NULL ["1.23456789E-9"]=> &NULL ["0.5"]=> &NULL [""]=> &NULL ["Nothing"]=> &NULL ["Hello World!"]=> &NULL ["Resource id #5"]=> &NULL } Done ================================================================================ 008+ &NULL 008- NULL 010+ &NULL 010- NULL 012+ &NULL 012- NULL 014+ &NULL 014- NULL 016+ &NULL 016- NULL 018+ &NULL 018- NULL 020+ &NULL 020- NULL 022+ &NULL 022- NULL 024+ &NULL 024- NULL 026+ &NULL 026- NULL 028+ &NULL 028- NULL 030+ &NULL 030- NULL 032+ &NULL 032- NULL 037+ &NULL 037- NULL 039+ &NULL 039- NULL 041+ &NULL 041- NULL 043+ &NULL 043- NULL 045+ &NULL 045- NULL 047+ &NULL 047- NULL 049+ &NULL 049- NULL 051+ &NULL 051- NULL 053+ &NULL 053- NULL 055+ &NULL 055- NULL 057+ &NULL 057- NULL 059+ &NULL 059- NULL 061+ &NULL 061- NULL ================================================================================ ================================================================================ /home/lars/src/php/php5.3-200811101130/ext/session/tests/session_register_variation3.phpt ================================================================================ *** Testing session_register() : variation *** bool(true) array(0) { } bool(true) array(1) { ["blah"]=> &string(12) "Hello World!" } bool(true) array(1) { ["blah"]=> &string(12) "Hello World!" } Done ================================================================================ 008+ &string(12) "Hello World!" 008- NULL 013+ &string(12) "Hello World!" 013- NULL ================================================================================ ================================================================================ /home/lars/src/php/php5.3-200811101130/ext/session/tests/session_register_variation4.phpt ================================================================================ *** Testing session_register() : variation *** bool(true) array(0) { } bool(true) array(1) { ["foo"]=> &string(12) "Hello World!" } bool(true) array(1) { ["foo"]=> &string(12) "Hello World!" } Done ================================================================================ 008+ &string(12) "Hello World!" 008- NULL 013+ &string(12) "Hello World!" 013- NULL ================================================================================ ================================================================================ /home/lars/src/php/php5.3-200811101130/ext/session/tests/session_set_save_handler_basic.phpt ================================================================================ *** Testing session_set_save_handler() : basic functionality *** string(5) "files" Warning: session_module_name(): Cannot find named PHP session module () in /home/lars/src/php/php5.3-200811101130/ext/session/tests/session_set_save_handler_basic.php on line 15 bool(false) Warning: session_module_name(): Cannot find named PHP session module (blah) in /home/lars/src/php/php5.3-200811101130/ext/session/tests/session_set_save_handler_basic.php on line 16 bool(false) Warning: session_module_name(): Cannot find named PHP session module (foo) in /home/lars/src/php/php5.3-200811101130/ext/session/tests/session_set_save_handler_basic.php on line 17 bool(false) Open [/home/lars/src/php/php5.3-200811101130/ext/session/tests,PHPSESSID] Read [/home/lars/src/php/php5.3-200811101130/ext/session/tests,29c85d3bafc10a023e9bded86c83a845] array(3) { ["Blah"]=> string(12) "Hello World!" ["Foo"]=> bool(false) ["Guff"]=> int(1234567890) } Write [/home/lars/src/php/php5.3-200811101130/ext/session/tests,29c85d3bafc10a023e9bded86c83a845,Blah|s:12:"Hello World!";Foo|b:0;Guff|i:1234567890;] Close [/home/lars/src/php/php5.3-200811101130/ext/session/tests,PHPSESSID] array(3) { ["Blah"]=> string(12) "Hello World!" ["Foo"]=> bool(false) ["Guff"]=> int(1234567890) } Starting session again..! Open [/home/lars/src/php/php5.3-200811101130/ext/session/tests,PHPSESSID] Read [/home/lars/src/php/php5.3-200811101130/ext/session/tests,29c85d3bafc10a023e9bded86c83a845] array(3) { ["Blah"]=> &string(12) "Hello World!" ["Foo"]=> &bool(false) ["Guff"]=> &int(1234567890) } Write [/home/lars/src/php/php5.3-200811101130/ext/session/tests,29c85d3bafc10a023e9bded86c83a845,Blah|s:12:"Hello World!";Foo|b:0;Guff|i:1234567890;] Close [/home/lars/src/php/php5.3-200811101130/ext/session/tests,PHPSESSID] ================================================================================ 038+ &string(12) "Hello World!" 038- string(12) "Hello World!" 040+ &bool(false) 040- bool(false) 042+ &int(1234567890) 042- int(1234567890) ================================================================================ ================================================================================ /home/lars/src/php/php5.3-200811101130/ext/session/tests/session_set_save_handler_closures.phpt ================================================================================ *** Testing session_set_save_handler() : using closures as callbacks *** string(5) "files" Warning: session_module_name(): Cannot find named PHP session module () in /home/lars/src/php/php5.3-200811101130/ext/session/tests/session_set_save_handler_closures.php on line 15 bool(false) Warning: session_module_name(): Cannot find named PHP session module (blah) in /home/lars/src/php/php5.3-200811101130/ext/session/tests/session_set_save_handler_closures.php on line 16 bool(false) Warning: session_module_name(): Cannot find named PHP session module (foo) in /home/lars/src/php/php5.3-200811101130/ext/session/tests/session_set_save_handler_closures.php on line 17 bool(false) Open [/home/lars/src/php/php5.3-200811101130/ext/session/tests,PHPSESSID] Read [/home/lars/src/php/php5.3-200811101130/ext/session/tests,039d058f4316b6849ce0d7143f2c3950] array(3) { ["Blah"]=> string(12) "Hello World!" ["Foo"]=> bool(false) ["Guff"]=> int(1234567890) } Write [/home/lars/src/php/php5.3-200811101130/ext/session/tests,039d058f4316b6849ce0d7143f2c3950,Blah|s:12:"Hello World!";Foo|b:0;Guff|i:1234567890;] Close [/home/lars/src/php/php5.3-200811101130/ext/session/tests,PHPSESSID] array(3) { ["Blah"]=> string(12) "Hello World!" ["Foo"]=> bool(false) ["Guff"]=> int(1234567890) } Starting session again..! Open [/home/lars/src/php/php5.3-200811101130/ext/session/tests,PHPSESSID] Read [/home/lars/src/php/php5.3-200811101130/ext/session/tests,039d058f4316b6849ce0d7143f2c3950] array(3) { ["Blah"]=> &string(12) "Hello World!" ["Foo"]=> &bool(false) ["Guff"]=> &int(1234567890) } Write [/home/lars/src/php/php5.3-200811101130/ext/session/tests,039d058f4316b6849ce0d7143f2c3950,Blah|s:12:"Hello World!";Foo|b:0;Guff|i:1234567890;] Close [/home/lars/src/php/php5.3-200811101130/ext/session/tests,PHPSESSID] ================================================================================ 038+ &string(12) "Hello World!" 038- string(12) "Hello World!" 040+ &bool(false) 040- bool(false) 042+ &int(1234567890) 042- int(1234567890) ================================================================================ ================================================================================ /home/lars/src/php/php5.3-200811101130/ext/session/tests/session_set_save_handler_variation4.phpt ================================================================================ *** Testing session_set_save_handler() : variation *** Open [/home/lars/src/php/php5.3-200811101130/ext/session/tests,PHPSESSID] Read [/home/lars/src/php/php5.3-200811101130/ext/session/tests,c9be5123764cb908773fe17139709f8b] GC [0] array(3) { ["Blah"]=> string(12) "Hello World!" ["Foo"]=> bool(false) ["Guff"]=> int(1234567890) } Write [/home/lars/src/php/php5.3-200811101130/ext/session/tests,c9be5123764cb908773fe17139709f8b,Blah|s:12:"Hello World!";Foo|b:0;Guff|i:1234567890;] Close [/home/lars/src/php/php5.3-200811101130/ext/session/tests,PHPSESSID] NULL Open [/home/lars/src/php/php5.3-200811101130/ext/session/tests,PHPSESSID] Read [/home/lars/src/php/php5.3-200811101130/ext/session/tests,c9be5123764cb908773fe17139709f8b] GC [0] array(3) { ["Blah"]=> &string(12) "Hello World!" ["Foo"]=> &bool(false) ["Guff"]=> &int(1234567890) } Destroy [/home/lars/src/php/php5.3-200811101130/ext/session/tests,c9be5123764cb908773fe17139709f8b] Warning: unlink(/home/lars/src/php/php5.3-200811101130/ext/session/tests/session_test_c9be5123764cb908773fe17139709f8b): No such file or directory in /home/lars/src/php/php5.3-200811101130/ext/session/tests/save_handler.inc on line 43 Close [/home/lars/src/php/php5.3-200811101130/ext/session/tests,PHPSESSID] bool(true) ================================================================================ 022+ &string(12) "Hello World!" 022- string(12) "Hello World!" 024+ &bool(false) 024- bool(false) 026+ &int(1234567890) 026- int(1234567890) ================================================================================ ================================================================================ /home/lars/src/php/php5.3-200811101130/ext/session/tests/session_start_variation6.phpt ================================================================================ *** Testing session_start() : variation *** array(4) { ["colour"]=> string(5) "green" ["animal"]=> string(3) "cat" ["person"]=> string(5) "julia" ["age"]=> int(6) } NULL array(4) { ["colour"]=> string(5) "green" ["animal"]=> string(3) "cat" ["person"]=> string(5) "julia" ["age"]=> int(6) } array(4) { ["colour"]=> &string(5) "green" ["animal"]=> &string(3) "cat" ["person"]=> &string(5) "julia" ["age"]=> &int(6) } Done ================================================================================ 025+ &string(5) "green" 025- string(5) "green" 027+ &string(3) "cat" 027- string(3) "cat" 029+ &string(5) "julia" 029- string(5) "julia" 031+ &int(6) 031- int(6) ================================================================================ ================================================================================ /home/lars/src/php/php5.3-200811101130/ext/session/tests/session_unregister_variation1.phpt ================================================================================ *** Testing session_unregister() : variation *** bool(true) array(0) { } bool(true) array(13) { ["0"]=> &NULL ["1"]=> &NULL ["12345"]=> &NULL ["-2345"]=> &NULL ["10.5"]=> &NULL ["-10.5"]=> &NULL ["123456789000"]=> &NULL ["1.23456789E-9"]=> &NULL ["0.5"]=> &NULL [""]=> &NULL ["Nothing"]=> &NULL ["Hello World!"]=> &NULL ["Resource id #5"]=> &NULL } bool(true) array(13) { ["0"]=> &NULL ["1"]=> &NULL ["12345"]=> &NULL ["-2345"]=> &NULL ["10.5"]=> &NULL ["-10.5"]=> &NULL ["123456789000"]=> &NULL ["1.23456789E-9"]=> &NULL ["0.5"]=> &NULL [""]=> &NULL ["Nothing"]=> &NULL ["Hello World!"]=> &NULL ["Resource id #5"]=> &NULL } Done ================================================================================ 008+ &NULL 008- NULL 010+ &NULL 010- NULL 012+ &NULL 012- NULL 014+ &NULL 014- NULL 016+ &NULL 016- NULL 018+ &NULL 018- NULL 020+ &NULL 020- NULL 022+ &NULL 022- NULL 024+ &NULL 024- NULL 026+ &NULL 026- NULL 028+ &NULL 028- NULL 030+ &NULL 030- NULL 032+ &NULL 032- NULL 037+ &NULL 037- NULL 039+ &NULL 039- NULL 041+ &NULL 041- NULL 043+ &NULL 043- NULL 045+ &NULL 045- NULL 047+ &NULL 047- NULL 049+ &NULL 049- NULL 051+ &NULL 051- NULL 053+ &NULL 053- NULL 055+ &NULL 055- NULL 057+ &NULL 057- NULL 059+ &NULL 059- NULL 061+ &NULL 061- NULL ================================================================================ ================================================================================ /home/lars/src/php/php5.3-200811101130/ext/soap/tests/bugs/bug34657.phpt ================================================================================ SoapFault SOAP-ERROR: Parsing WSDL: Couldn't load from 'http://i_dont_exist.com/some.wsdl' : failed to load external entity "http://i_dont_exist.com/some.wsdl" ok ================================================================================ 001+ SoapFault 002+ SOAP-ERROR: Parsing WSDL: Couldn't load from 'http://i_dont_exist.com/some.wsdl' : failed to load external entity "http://i_dont_exist.com/some.wsdl" 001- Warning: SoapClient::SoapClient(): %s %sbug34657.php on line 3 003- Warning: SoapClient::SoapClient(http://i_dont_exist.com/some.wsdl): failed to open stream: %sbug34657.php on line 3 004- 005- Warning: SoapClient::SoapClient(): I/O warning : failed to load external entity "http://i_dont_exist.com/some.wsdl" in %sbug34657.php on line 3 006- SoapFault 007- SOAP-ERROR: Parsing WSDL: Couldn't load from 'http://i_dont_exist.com/some.wsdl' ================================================================================ ================================================================================ /home/lars/src/php/php5.3-200811101130/ext/soap/tests/bugs/bug42151.phpt ================================================================================ SOAP-ERROR: Parsing WSDL: Couldn't load from 'httpx://' : failed to load external entity "httpx%3A//" ok I don't get executed either. ================================================================================ 001+ SOAP-ERROR: Parsing WSDL: Couldn't load from 'httpx://' : failed to load external entity "httpx%3A//" 001- SOAP-ERROR: Parsing WSDL: Couldn't load from 'httpx://' : failed to load external entity "httpx://" ================================================================================ ================================================================================ /home/lars/src/php/php5.3-200811101130/ext/spl/tests/dit_003.phpt ================================================================================ Fatal error: Uncaught exception 'UnexpectedValueException' with message 'FilesystemIterator::__construct(CVS): failed to open dir: No such file or directory' in /home/lars/src/php/php5.3-200811101130/ext/spl/tests/dit_003.php:3 Stack trace: #0 /home/lars/src/php/php5.3-200811101130/ext/spl/tests/dit_003.php(3): FilesystemIterator->__construct('CVS') #1 {main} thrown in /home/lars/src/php/php5.3-200811101130/ext/spl/tests/dit_003.php on line 3 ================================================================================ 001+ Fatal error: Uncaught exception 'UnexpectedValueException' with message 'FilesystemIterator::__construct(CVS): failed to open dir: No such file or directory' in /home/lars/src/php/php5.3-200811101130/ext/spl/tests/dit_003.php:3 002+ Stack trace: 001- bool(true) 002- ===DONE=== 003+ #0 /home/lars/src/php/php5.3-200811101130/ext/spl/tests/dit_003.php(3): FilesystemIterator->__construct('CVS') 004+ #1 {main} 005+ thrown in /home/lars/src/php/php5.3-200811101130/ext/spl/tests/dit_003.php on line 3 ================================================================================ ================================================================================ /home/lars/src/php/php5.3-200811101130/ext/standard/tests/strings/similar_text_basic.phpt ================================================================================ int(3) int(0) int(1) int(7) float(54.5454545455) float(0) float(18.1818181818) float(51.8518518519) ===DONE=== ================================================================================ 005+ float(54.5454545455) 005- float(54.545454545455) 007+ float(18.1818181818) 008+ float(51.8518518519) 007- float(18.181818181818) 008- float(51.851851851852) ================================================================================ ================================================================================ /home/lars/src/php/php5.3-200811101130/sapi/cgi/tests/006.phpt ================================================================================ string(96) "No syntax errors detected in /home/lars/src/php/php5.3-200811101130/sapi/cgi/tests/006.test.php " string(25) "No input file specified. " string(82) "Errors parsing /home/lars/src/php/php5.3-200811101130/sapi/cgi/tests/006.test.php " Done ================================================================================ 005+ string(82) "Errors parsing /home/lars/src/php/php5.3-200811101130/sapi/cgi/tests/006.test.php 005- string(%d) "<br /> 006- <b>Parse error</b>: %s expecting %s{%s in <b>%s006.test.php</b> on line <b>5</b><br /> 007- Errors parsing %s006.test.php ================================================================================ ================================================================================ BUILD ENVIRONMENT ================================================================================ OS: Linux - Linux hera.tacotec.de 2.4.27-3-686 #1 Tue Dec 5 21:03:54 UTC 2006 i686 Autoconf: autoconf (GNU Autoconf) 2.59 Written by David J. MacKenzie and Akim Demaille. Copyright (C) 2003 Free Software Foundation, Inc. This is free software; see the source for copying conditions. There is NO warranty; not even for MERCHANTABILITY or FITNESS FOR A PARTICULAR PURPOSE. Bundled Libtool: ltmain.sh (GNU libtool) 1.5.20 (1.1220.2.287 2005/08/31 18:54:15) Copyright (C) 2005 Free Software Foundation, Inc. This is free software; see the source for copying conditions. There is NO warranty; not even for MERCHANTABILITY or FITNESS FOR A PARTICULAR PURPOSE. System Libtool: ltmain.sh (GNU libtool) 1.5.6 (1.1220.2.95 2004/04/11 05:50:42) Debian: 224 $ Copyright (C) 2003 Free Software Foundation, Inc. This is free software; see the source for copying conditions. There is NO warranty; not even for MERCHANTABILITY or FITNESS FOR A PARTICULAR PURPOSE. Compiler: Lese Spezifikationen von /usr/lib/gcc-lib/i486-linux/3.3.5/specs Konfiguriert mit: ../src/configure -v --enable-languages=c,c++,java,f77,pascal,objc,ada,treelang --prefix=/usr --mandir=/usr/share/man --infodir=/usr/share/info --with-gxx-include-dir=/usr/include/c++/3.3 --enable-shared --enable-__cxa_atexit --with-system-zlib --enable-nls --without-included-gettext --enable-clocale=gnu --enable-debug --enable-java-gc=boehm --enable-java-awt=xlib --enable-objc-gc i486-linux Thread-Modell: posix gcc-Version 3.3.5 (Debian 1:3.3.5-13) Bison: bison (GNU Bison) 1.875d Geschrieben von Robert Corbett und Richard Stallman. Copyright © 2004 Free Software Foundation, Inc. Dies ist freie Software; die Kopierbedingungen stehen in den Quellen. Es gibt keine Garantie; auch nicht für VERKAUFBARKEIT oder FÜR SPEZIELLE ZWECKE. Libraries: libcrypt.so.1 => /lib/libcrypt.so.1 (0x40022000) librt.so.1 => /lib/librt.so.1 (0x4004f000) libmysqlclient.so.14 => /usr/lib/libmysqlclient.so.14 (0x40062000) libm.so.6 => /lib/libm.so.6 (0x4016b000) libz.so.1 => /usr/lib/libz.so.1 (0x4018d000) libpng12.so.0 => /usr/lib/libpng12.so.0 (0x4019f000) libresolv.so.2 => /lib/libresolv.so.2 (0x401c4000) libdl.so.2 => /lib/libdl.so.2 (0x401d6000) libnsl.so.1 => /lib/libnsl.so.1 (0x401d9000) libxml2.so.2 => /usr/lib/libxml2.so.2 (0x401ef000) libpthread.so.0 => /lib/libpthread.so.0 (0x402f6000) libc.so.6 => /lib/libc.so.6 (0x40347000) /lib/ld-linux.so.2 => /lib/ld-linux.so.2 (0x40000000) User's E-mail: lars dot duesing at camelotsweb dot de ================================================================================ PHPINFO ================================================================================ phpinfo() PHP Version => 5.3.0alpha3-dev System => Linux hera.tacotec.de 2.4.27-3-686 #1 Tue Dec 5 21:03:54 UTC 2006 i686 Build Date => Nov 10 2008 13:18:20 Configure Command => './configure' '--prefix=/usr/local/php5/' '--with-zlib' '--with-zlib-dir=/usr/lib' '--with-mysql' '--with-gd' '--enable-soap' '--enable-sockets' '--enable-cgi' '--with-libxml-dir=/usr/lib' Server API => Command Line Interface Virtual Directory Support => disabled Configuration File (php.ini) Path => /usr/local/php5//lib Loaded Configuration File => /usr/local/php5/lib/php.ini Scan this dir for additional .ini files => (none) additional .ini files parsed => (none) PHP API => 20041225 PHP Extension => 20071006 Zend Extension => 220070929 Debug Build => no Thread Safety => disabled Zend Memory Manager => enabled Zend Multibyte Support => disabled IPv6 Support => enabled Registered PHP Streams => php, file, glob, data, http, ftp, compress.zlib, phar Registered Stream Socket Transports => tcp, udp, unix, udg Registered Stream Filters => string.rot13, string.toupper, string.tolower, string.strip_tags, convert.*, consumed, zlib.*, convert.iconv.* This program makes use of the Zend Scripting Language Engine: Zend Engine v2.3.0, Copyright (c) 1998-2008 Zend Technologies with Zend Extension Manager v1.0.9, Copyright (c) 2003-2006, by Zend Technologies _______________________________________________________________________ Configuration PHP Core Directive => Local Value => Master Value allow_call_time_pass_reference => On => On allow_url_fopen => On => On allow_url_include => Off => Off always_populate_raw_post_data => Off => Off arg_separator.input => & => & arg_separator.output => & => & asp_tags => Off => Off auto_append_file => no value => no value auto_globals_jit => On => On auto_prepend_file => no value => no value browscap => no value => no value default_charset => no value => no value default_mimetype => text/html => text/html define_syslog_variables => Off => Off disable_classes => no value => no value disable_functions => no value => no value display_errors => STDERR => STDERR display_startup_errors => Off => Off doc_root => no value => no value docref_ext => no value => no value docref_root => no value => no value enable_dl => On => On error_append_string => no value => no value error_log => no value => no value error_prepend_string => no value => no value error_reporting => 30711 => 30711 exit_on_timeout => Off => Off expose_php => On => On extension_dir => /usr/local/php5//lib/php/extensions/no-debug-non-zts-20071006 => /usr/local/php5//lib/php/extensions/no-debug-non-zts-20071006 file_uploads => On => On highlight.bg => <font style="color: #FFFFFF">#FFFFFF</font> => <font style="color: #FFFFFF">#FFFFFF</font> highlight.comment => <font style="color: #FF8000">#FF8000</font> => <font style="color: #FF8000">#FF8000</font> highlight.default => <font style="color: #0000BB">#0000BB</font> => <font style="color: #0000BB">#0000BB</font> highlight.html => <font style="color: #000000">#000000</font> => <font style="color: #000000">#000000</font> highlight.keyword => <font style="color: #007700">#007700</font> => <font style="color: #007700">#007700</font> highlight.string => <font style="color: #DD0000">#DD0000</font> => <font style="color: #DD0000">#DD0000</font> html_errors => Off => Off ignore_repeated_errors => Off => Off ignore_repeated_source => Off => Off ignore_user_abort => Off => Off implicit_flush => On => On include_path => .:/usr/local/php5//lib/php => .:/usr/local/php5//lib/php log_errors => On => On log_errors_max_len => 1024 => 1024 magic_quotes_gpc => Off => Off magic_quotes_runtime => Off => Off magic_quotes_sybase => Off => Off mail.force_extra_parameters => no value => no value max_execution_time => 0 => 0 max_input_nesting_level => 64 => 64 max_input_time => -1 => -1 memory_limit => 64M => 64M open_basedir => no value => no value output_buffering => 0 => 0 output_handler => no value => no value post_max_size => 15M => 15M precision => 12 => 12 realpath_cache_size => 16K => 16K realpath_cache_ttl => 120 => 120 register_argc_argv => On => On register_globals => On => On register_long_arrays => On => On report_memleaks => On => On report_zend_debug => Off => Off request_order => no value => no value safe_mode => Off => Off safe_mode_exec_dir => no value => no value safe_mode_gid => Off => Off safe_mode_include_dir => no value => no value sendmail_from => no value => no value sendmail_path => /usr/sbin/sendmail -t -i => /usr/sbin/sendmail -t -i serialize_precision => 100 => 100 short_open_tag => On => On SMTP => localhost => localhost smtp_port => 25 => 25 sql.safe_mode => Off => Off track_errors => Off => Off unserialize_callback_func => no value => no value upload_max_filesize => 30M => 30M upload_tmp_dir => no value => no value user_dir => no value => no value user_ini.cache_ttl => 300 => 300 user_ini.filename => .user.ini => .user.ini variables_order => EGPCS => EGPCS xmlrpc_error_number => 0 => 0 xmlrpc_errors => Off => Off y2k_compliance => On => On zend.enable_gc => On => On ctype ctype functions => enabled date date/time support => enabled "Olson" Timezone Database Version => 2008.9 Timezone Database => internal Default timezone => Europe/Berlin Directive => Local Value => Master Value date.default_latitude => 31.7667 => 31.7667 date.default_longitude => 35.2333 => 35.2333 date.sunrise_zenith => 90.583333 => 90.583333 date.sunset_zenith => 90.583333 => 90.583333 date.timezone => no value => no value dom DOM/XML => enabled DOM/XML API Version => 20031129 libxml Version => 2.6.16 HTML Support => enabled XPath Support => enabled XPointer Support => enabled Schema Support => enabled RelaxNG Support => enabled ereg Regex Library => Bundled library enabled fileinfo fileinfo support => enabled version => 1.0.5-dev filter Input Validation and Filtering => enabled Revision => $Revision: 1.52.2.39.2.10 $ Directive => Local Value => Master Value filter.default => unsafe_raw => unsafe_raw filter.default_flags => no value => no value gd GD Support => enabled GD Version => bundled (2.0.34 compatible) GIF Read Support => enabled GIF Create Support => enabled PNG Support => enabled libPNG Version => 1.2.8 WBMP Support => enabled XBM Support => enabled hash hash support => enabled Hashing Engines => md2 md4 md5 sha1 sha224 sha256 sha384 sha512 ripemd128 ripemd160 ripemd256 ripemd320 whirlpool tiger128,3 tiger160,3 tiger192,3 tiger128,4 tiger160,4 tiger192,4 snefru snefru256 gost adler32 crc32 crc32b haval128,3 haval160,3 haval192,3 haval224,3 haval256,3 haval128,4 haval160,4 haval192,4 haval224,4 haval256,4 haval128,5 haval160,5 haval192,5 haval224,5 haval256,5 iconv iconv support => enabled iconv implementation => glibc iconv library version => 2.3.2 Directive => Local Value => Master Value iconv.input_encoding => ISO-8859-1 => ISO-8859-1 iconv.internal_encoding => ISO-8859-1 => ISO-8859-1 iconv.output_encoding => ISO-8859-1 => ISO-8859-1 json json support => enabled json version => 1.2.1 libxml libXML support => active libXML Version => 2.6.16 libXML streams => enabled mysql MySQL Support => enabled Active Persistent Links => 0 Active Links => 0 Client API version => 4.1.11 MYSQL_MODULE_TYPE => external MYSQL_SOCKET => /var/run/mysqld/mysqld.sock MYSQL_INCLUDE => -I/usr/include/mysql MYSQL_LIBS => -L/usr/lib -lmysqlclient Directive => Local Value => Master Value mysql.allow_local_infile => On => On mysql.allow_persistent => On => On mysql.connect_timeout => 60 => 60 mysql.default_host => no value => no value mysql.default_password => no value => no value mysql.default_port => no value => no value mysql.default_socket => /var/run/mysqld/mysqld.sock => /var/run/mysqld/mysqld.sock mysql.default_user => no value => no value mysql.max_links => Unlimited => Unlimited mysql.max_persistent => Unlimited => Unlimited mysql.trace_mode => Off => Off pcre PCRE (Perl Compatible Regular Expressions) Support => enabled PCRE Library Version => 7.8 2008-09-05 Directive => Local Value => Master Value pcre.backtrack_limit => 100000 => 100000 pcre.recursion_limit => 100000 => 100000 PDO PDO support => enabled PDO drivers => sqlite2, sqlite pdo_sqlite PDO Driver for SQLite 3.x => enabled SQLite Library => 3.6.2 Phar Phar: PHP Archive support => enabled Phar EXT version => 2.0.0-dev Phar API version => 1.1.1 CVS revision => $Revision: 1.370.2.54 $ Phar-based phar archives => enabled Tar-based phar archives => enabled ZIP-based phar archives => enabled gzip compression => enabled bzip2 compression => disabled (install pecl/bz2) OpenSSL support => disabled (install ext/openssl) Phar based on pear/PHP_Archive, original concept by Davey Shafik. Phar fully realized by Gregory Beaver and Marcus Boerger. Portions of tar implementation Copyright (c) 2003-2008 Tim Kientzle. Directive => Local Value => Master Value phar.cache_list => no value => no value phar.readonly => On => On phar.require_hash => On => On posix Revision => $Revision: 1.70.2.3.2.16.2.12 $ Reflection Reflection => enabled Version => $Id: php_reflection.c,v 1.164.2.33.2.45.2.39 2008/11/04 15:58:55 helly Exp $ session Session Support => enabled Registered save handlers => files user sqlite Registered serializer handlers => php php_binary Directive => Local Value => Master Value session.auto_start => Off => Off session.bug_compat_42 => On => On session.bug_compat_warn => On => On session.cache_expire => 180 => 180 session.cache_limiter => nocache => nocache session.cookie_domain => no value => no value session.cookie_httponly => Off => Off session.cookie_lifetime => 0 => 0 session.cookie_path => / => / session.cookie_secure => Off => Off session.entropy_file => no value => no value session.entropy_length => 0 => 0 session.gc_divisor => 100 => 100 session.gc_maxlifetime => 3000 => 3000 session.gc_probability => 1 => 1 session.hash_bits_per_character => 4 => 4 session.hash_function => 0 => 0 session.name => PHPSESSID => PHPSESSID session.referer_check => no value => no value session.save_handler => files => files session.save_path => no value => no value session.serialize_handler => php => php session.use_cookies => On => On session.use_only_cookies => On => On session.use_trans_sid => 0 => 0 SimpleXML Simplexml support => enabled Revision => $Revision: 1.151.2.22.2.35.2.26 $ Schema support => enabled soap Soap Client => enabled Soap Server => enabled Directive => Local Value => Master Value soap.wsdl_cache => 1 => 1 soap.wsdl_cache_dir => /tmp => /tmp soap.wsdl_cache_enabled => 1 => 1 soap.wsdl_cache_limit => 5 => 5 soap.wsdl_cache_ttl => 86400 => 86400 sockets Sockets Support => enabled SPL SPL support => enabled Interfaces => Countable, OuterIterator, RecursiveIterator, SeekableIterator, SplObserver, SplSubject Classes => AppendIterator, ArrayIterator, ArrayObject, BadFunctionCallException, BadMethodCallException, CachingIterator, DirectoryIterator, DomainException, EmptyIterator, FilesystemIterator, FilterIterator, GlobIterator, InfiniteIterator, InvalidArgumentException, IteratorIterator, LengthException, LimitIterator, LogicException, MultipleIterator, NoRewindIterator, OutOfBoundsException, OutOfRangeException, OverflowException, ParentIterator, RangeException, RecursiveArrayIterator, RecursiveCachingIterator, RecursiveDirectoryIterator, RecursiveFilterIterator, RecursiveIteratorIterator, RecursiveRegexIterator, RecursiveTreeIterator, RegexIterator, RuntimeException, SplDoublyLinkedList, SplFileInfo, SplFileObject, SplFixedArray, SplHeap, SplMinHeap, SplMaxHeap, SplObjectStorage, SplPriorityQueue, SplQueue, SplStack, SplTempFileObject, UnderflowException, UnexpectedValueException SQLite SQLite support => enabled PECL Module version => 2.0-dev $Id: sqlite.c,v 1.166.2.13.2.9.2.14 2008/11/02 21:19:36 felipe Exp $ SQLite Library => 2.8.17 SQLite Encoding => iso8859 Directive => Local Value => Master Value sqlite.assoc_case => 0 => 0 sqlite3 SQLite3 support => enabled SQLite3 module version => 0.7-dev SQLite Library => 3.6.2 Directive => Local Value => Master Value sqlite3.extension_dir => no value => no value standard Dynamic Library Support => enabled Path to sendmail => /usr/sbin/sendmail -t -i Directive => Local Value => Master Value assert.active => 1 => 1 assert.bail => 0 => 0 assert.callback => no value => no value assert.quiet_eval => 0 => 0 assert.warning => 1 => 1 auto_detect_line_endings => 0 => 0 default_socket_timeout => 60 => 60 safe_mode_allowed_env_vars => PHP_ => PHP_ safe_mode_protected_env_vars => LD_LIBRARY_PATH => LD_LIBRARY_PATH url_rewriter.tags => a=href,area=href,frame=src,input=src,form=,fieldset= => a=href,area=href,frame=src,input=src,form=,fieldset= user_agent => no value => no value tokenizer Tokenizer Support => enabled xml XML Support => active XML Namespace Support => active libxml2 Version => 2.6.16 xmlreader XMLReader => enabled xmlwriter XMLWriter => enabled zlib ZLib Support => enabled Stream Wrapper support => compress.zlib:// Stream Filter support => zlib.inflate, zlib.deflate Compiled Version => 1.2.2 Linked Version => 1.2.2 Directive => Local Value => Master Value zlib.output_compression => Off => Off zlib.output_compression_level => -1 => -1 zlib.output_handler => no value => no value Additional Modules Module Name Environment Variable => Value TEST_PHP_SRCDIR => /home/lars/src/php/php5.3-200811101130 SHELL => /bin/sh TERM => xterm MAKEFLAGS => SSH_CLIENT => deleted SSH_TTY => deleted USER => lars LS_COLORS => no=00:fi=00:di=01;34:ln=01;36:pi=40;33:so=01;35:do=01;35:bd=40;33;01:cd=40;33;01:or=40;31;01:ex=01;32:*.tar=01;31:*.tgz=01;31:*.arj=01;31:*.taz=01;31:*.lzh=01;31:*.zip=01;31:*.z=01;31:*.Z=01;31:*.gz=01;31:*.bz2=01;31:*.deb=01;31:*.rpm=01;31:*.jar=01;31:*.jpg=01;35:*.jpeg=01;35:*.gif=01;35:*.bmp=01;35:*.pbm=01;35:*.pgm=01;35:*.ppm=01;35:*.tga=01;35:*.xbm=01;35:*.xpm=01;35:*.tif=01;35:*.tiff=01;35:*.png=01;35:*.mov=01;35:*.mpg=01;35:*.mpeg=01;35:*.avi=01;35:*.fli=01;35:*.gl=01;35:*.dl=01;35:*.xcf=01;35:*.xwd=01;35:*.ogg=01;35:*.mp3=01;35:*.wav=01;35: SSH_AUTH_SOCK => deleted TERMCAP => SC|xterm|VT 100/ANSI X3.64 virtual terminal:\ :hs:ts=\E_:fs=\E\\:ds=\E_\E\\:\ :DO=\E[%dB:LE=\E[%dD:RI=\E[%dC:UP=\E[%dA:bs:bt=\E[Z:\ :cd=\E[J:ce=\E[K:cl=\E[H\E[J:cm=\E[%i%d;%dH:ct=\E[3g:\ :do=^J:nd=\E[C:pt:rc=\E8:rs=\Ec:sc=\E7:st=\EH:up=\EM:\ :le=^H:bl=^G:cr=^M:it#8:ho=\E[H:nw=\EE:ta=^I:is=\E)0:\ :li#24:co#80:am:xn:xv:LP:sr=\EM:al=\E[L:AL=\E[%dL:\ :cs=\E[%i%d;%dr:dl=\E[M:DL=\E[%dM:dc=\E[P:DC=\E[%dP:\ :im=\E[4h:ei=\E[4l:mi:IC=\E[%d@:ks=\E[?1h\E=:\ :ke=\E[?1l\E>:vi=\E[?25l:ve=\E[34h\E[?25h:vs=\E[34l:\ :ti=\E[?1049h:te=\E[?1049l:us=\E[4m:ue=\E[24m:so=\E[3m:\ :se=\E[23m:mb=\E[5m:md=\E[1m:mr=\E[7m:me=\E[m:ms:\ :Co#8:pa#64:AF=\E[3%dm:AB=\E[4%dm:op=\E[39;49m:AX:\ :vb=\Eg:G0:as=\E(0:ae=\E(B:\ :ac=\140\140aaffggjjkkllmmnnooppqqrrssttuuvvwwxxyyzz{{||}}~~..--++,,hhII00:\ :po=\E[5i:pf=\E[4i:Z0=\E[?3h:Z1=\E[?3l:k0=\E[10~:\ :k1=\EOP:k2=\EOQ:k3=\EOR:k4=\EOS:k5=\E[15~:k6=\E[17~:\ :k7=\E[18~:k8=\E[19~:k9=\E[20~:k;=\E[21~:F1=\E[23~:\ :F2=\E[24~:F3=\EO2P:F4=\EO2Q:F5=\EO2R:F6=\EO2S:\ :F7=\E[15;2~:F8=\E[17;2~:F9=\E[18;2~:FA=\E[19;2~:kb=:\ :K2=\EOE:kB=\E[Z:*4=\E[3;5~:*7=\EO5F:#2=\EO5H:\ :#3=\E[2;5~:#4=\EO5D:%c=\E[6;5~:%e=\E[5;5~:%i=\EO5C:\ :kh=\E[1~:@1=\E[1~:kH=\E[4~:@7=\E[4~:kN=\E[6~:kP=\E[5~:\ :kI=\E[2~:kD=\E[3~:ku=\EOA:kd=\EOB:kr=\EOC:kl=\EOD:km: MAKELEVEL => 1 MFLAGS => PATH => /usr/local/bin:/usr/bin:/bin:/usr/bin/X11:/usr/games MAIL => /var/mail/lars STY => 9795.pts-35.hera _ => /home/lars/src/php/php5.3-200811101130/sapi/cli/php PWD => /home/lars/src/php/php5.3-200811101130 LANG => de_DE@euro TEST_PHP_EXECUTABLE => /home/lars/src/php/php5.3-200811101130/sapi/cli/php HOME => /home/lars SHLVL => 4 LOGNAME => lars WINDOW => 2 SSH_CONNECTION => deleted CC => gcc PHP Variables Variable => Value PHP_SELF => _SERVER["TEST_PHP_SRCDIR"] => /home/lars/src/php/php5.3-200811101130 _SERVER["SHELL"] => /bin/sh _SERVER["TERM"] => xterm _SERVER["MAKEFLAGS"] => _SERVER["SSH_CLIENT"] => deleted _SERVER["SSH_TTY"] => deleted _SERVER["USER"] => lars _SERVER["LS_COLORS"] => no=00:fi=00:di=01;34:ln=01;36:pi=40;33:so=01;35:do=01;35:bd=40;33;01:cd=40;33;01:or=40;31;01:ex=01;32:*.tar=01;31:*.tgz=01;31:*.arj=01;31:*.taz=01;31:*.lzh=01;31:*.zip=01;31:*.z=01;31:*.Z=01;31:*.gz=01;31:*.bz2=01;31:*.deb=01;31:*.rpm=01;31:*.jar=01;31:*.jpg=01;35:*.jpeg=01;35:*.gif=01;35:*.bmp=01;35:*.pbm=01;35:*.pgm=01;35:*.ppm=01;35:*.tga=01;35:*.xbm=01;35:*.xpm=01;35:*.tif=01;35:*.tiff=01;35:*.png=01;35:*.mov=01;35:*.mpg=01;35:*.mpeg=01;35:*.avi=01;35:*.fli=01;35:*.gl=01;35:*.dl=01;35:*.xcf=01;35:*.xwd=01;35:*.ogg=01;35:*.mp3=01;35:*.wav=01;35: _SERVER["SSH_AUTH_SOCK"] => deleted _SERVER["TERMCAP"] => SC|xterm|VT 100/ANSI X3.64 virtual terminal:\ :hs:ts=\E_:fs=\E\\:ds=\E_\E\\:\ :DO=\E[%dB:LE=\E[%dD:RI=\E[%dC:UP=\E[%dA:bs:bt=\E[Z:\ :cd=\E[J:ce=\E[K:cl=\E[H\E[J:cm=\E[%i%d;%dH:ct=\E[3g:\ :do=^J:nd=\E[C:pt:rc=\E8:rs=\Ec:sc=\E7:st=\EH:up=\EM:\ :le=^H:bl=^G:cr=^M:it#8:ho=\E[H:nw=\EE:ta=^I:is=\E)0:\ :li#24:co#80:am:xn:xv:LP:sr=\EM:al=\E[L:AL=\E[%dL:\ :cs=\E[%i%d;%dr:dl=\E[M:DL=\E[%dM:dc=\E[P:DC=\E[%dP:\ :im=\E[4h:ei=\E[4l:mi:IC=\E[%d@:ks=\E[?1h\E=:\ :ke=\E[?1l\E>:vi=\E[?25l:ve=\E[34h\E[?25h:vs=\E[34l:\ :ti=\E[?1049h:te=\E[?1049l:us=\E[4m:ue=\E[24m:so=\E[3m:\ :se=\E[23m:mb=\E[5m:md=\E[1m:mr=\E[7m:me=\E[m:ms:\ :Co#8:pa#64:AF=\E[3%dm:AB=\E[4%dm:op=\E[39;49m:AX:\ :vb=\Eg:G0:as=\E(0:ae=\E(B:\ :ac=\140\140aaffggjjkkllmmnnooppqqrrssttuuvvwwxxyyzz{{||}}~~..--++,,hhII00:\ :po=\E[5i:pf=\E[4i:Z0=\E[?3h:Z1=\E[?3l:k0=\E[10~:\ :k1=\EOP:k2=\EOQ:k3=\EOR:k4=\EOS:k5=\E[15~:k6=\E[17~:\ :k7=\E[18~:k8=\E[19~:k9=\E[20~:k;=\E[21~:F1=\E[23~:\ :F2=\E[24~:F3=\EO2P:F4=\EO2Q:F5=\EO2R:F6=\EO2S:\ :F7=\E[15;2~:F8=\E[17;2~:F9=\E[18;2~:FA=\E[19;2~:kb=:\ :K2=\EOE:kB=\E[Z:*4=\E[3;5~:*7=\EO5F:#2=\EO5H:\ :#3=\E[2;5~:#4=\EO5D:%c=\E[6;5~:%e=\E[5;5~:%i=\EO5C:\ :kh=\E[1~:@1=\E[1~:kH=\E[4~:@7=\E[4~:kN=\E[6~:kP=\E[5~:\ :kI=\E[2~:kD=\E[3~:ku=\EOA:kd=\EOB:kr=\EOC:kl=\EOD:km: _SERVER["MAKELEVEL"] => 1 _SERVER["MFLAGS"] => _SERVER["PATH"] => /usr/local/bin:/usr/bin:/bin:/usr/bin/X11:/usr/games _SERVER["MAIL"] => /var/mail/lars _SERVER["STY"] => 9795.pts-35.hera _SERVER["_"] => /home/lars/src/php/php5.3-200811101130/sapi/cli/php _SERVER["PWD"] => /home/lars/src/php/php5.3-200811101130 _SERVER["LANG"] => de_DE@euro _SERVER["TEST_PHP_EXECUTABLE"] => /home/lars/src/php/php5.3-200811101130/sapi/cli/php _SERVER["HOME"] => /home/lars _SERVER["SHLVL"] => 4 _SERVER["LOGNAME"] => lars _SERVER["WINDOW"] => 2 _SERVER["SSH_CONNECTION"] => deleted _SERVER["CC"] => gcc _SERVER["PHP_SELF"] => _SERVER["SCRIPT_NAME"] => _SERVER["SCRIPT_FILENAME"] => _SERVER["PATH_TRANSLATED"] => _SERVER["DOCUMENT_ROOT"] => _SERVER["REQUEST_TIME"] => 1226320543 _SERVER["argv"] => Array ( ) _SERVER["argc"] => 0 _ENV["TEST_PHP_SRCDIR"] => /home/lars/src/php/php5.3-200811101130 _ENV["SHELL"] => /bin/sh _ENV["TERM"] => xterm _ENV["MAKEFLAGS"] => _ENV["SSH_CLIENT"] => deleted _ENV["SSH_TTY"] => deleted _ENV["USER"] => lars _ENV["LS_COLORS"] => no=00:fi=00:di=01;34:ln=01;36:pi=40;33:so=01;35:do=01;35:bd=40;33;01:cd=40;33;01:or=40;31;01:ex=01;32:*.tar=01;31:*.tgz=01;31:*.arj=01;31:*.taz=01;31:*.lzh=01;31:*.zip=01;31:*.z=01;31:*.Z=01;31:*.gz=01;31:*.bz2=01;31:*.deb=01;31:*.rpm=01;31:*.jar=01;31:*.jpg=01;35:*.jpeg=01;35:*.gif=01;35:*.bmp=01;35:*.pbm=01;35:*.pgm=01;35:*.ppm=01;35:*.tga=01;35:*.xbm=01;35:*.xpm=01;35:*.tif=01;35:*.tiff=01;35:*.png=01;35:*.mov=01;35:*.mpg=01;35:*.mpeg=01;35:*.avi=01;35:*.fli=01;35:*.gl=01;35:*.dl=01;35:*.xcf=01;35:*.xwd=01;35:*.ogg=01;35:*.mp3=01;35:*.wav=01;35: _ENV["SSH_AUTH_SOCK"] => deleted _ENV["TERMCAP"] => SC|xterm|VT 100/ANSI X3.64 virtual terminal:\ :hs:ts=\E_:fs=\E\\:ds=\E_\E\\:\ :DO=\E[%dB:LE=\E[%dD:RI=\E[%dC:UP=\E[%dA:bs:bt=\E[Z:\ :cd=\E[J:ce=\E[K:cl=\E[H\E[J:cm=\E[%i%d;%dH:ct=\E[3g:\ :do=^J:nd=\E[C:pt:rc=\E8:rs=\Ec:sc=\E7:st=\EH:up=\EM:\ :le=^H:bl=^G:cr=^M:it#8:ho=\E[H:nw=\EE:ta=^I:is=\E)0:\ :li#24:co#80:am:xn:xv:LP:sr=\EM:al=\E[L:AL=\E[%dL:\ :cs=\E[%i%d;%dr:dl=\E[M:DL=\E[%dM:dc=\E[P:DC=\E[%dP:\ :im=\E[4h:ei=\E[4l:mi:IC=\E[%d@:ks=\E[?1h\E=:\ :ke=\E[?1l\E>:vi=\E[?25l:ve=\E[34h\E[?25h:vs=\E[34l:\ :ti=\E[?1049h:te=\E[?1049l:us=\E[4m:ue=\E[24m:so=\E[3m:\ :se=\E[23m:mb=\E[5m:md=\E[1m:mr=\E[7m:me=\E[m:ms:\ :Co#8:pa#64:AF=\E[3%dm:AB=\E[4%dm:op=\E[39;49m:AX:\ :vb=\Eg:G0:as=\E(0:ae=\E(B:\ :ac=\140\140aaffggjjkkllmmnnooppqqrrssttuuvvwwxxyyzz{{||}}~~..--++,,hhII00:\ :po=\E[5i:pf=\E[4i:Z0=\E[?3h:Z1=\E[?3l:k0=\E[10~:\ :k1=\EOP:k2=\EOQ:k3=\EOR:k4=\EOS:k5=\E[15~:k6=\E[17~:\ :k7=\E[18~:k8=\E[19~:k9=\E[20~:k;=\E[21~:F1=\E[23~:\ :F2=\E[24~:F3=\EO2P:F4=\EO2Q:F5=\EO2R:F6=\EO2S:\ :F7=\E[15;2~:F8=\E[17;2~:F9=\E[18;2~:FA=\E[19;2~:kb=:\ :K2=\EOE:kB=\E[Z:*4=\E[3;5~:*7=\EO5F:#2=\EO5H:\ :#3=\E[2;5~:#4=\EO5D:%c=\E[6;5~:%e=\E[5;5~:%i=\EO5C:\ :kh=\E[1~:@1=\E[1~:kH=\E[4~:@7=\E[4~:kN=\E[6~:kP=\E[5~:\ :kI=\E[2~:kD=\E[3~:ku=\EOA:kd=\EOB:kr=\EOC:kl=\EOD:km: _ENV["MAKELEVEL"] => 1 _ENV["MFLAGS"] => _ENV["PATH"] => /usr/local/bin:/usr/bin:/bin:/usr/bin/X11:/usr/games _ENV["MAIL"] => /var/mail/lars _ENV["STY"] => 9795.pts-35.hera _ENV["_"] => /home/lars/src/php/php5.3-200811101130/sapi/cli/php _ENV["PWD"] => /home/lars/src/php/php5.3-200811101130 _ENV["LANG"] => de_DE@euro _ENV["TEST_PHP_EXECUTABLE"] => /home/lars/src/php/php5.3-200811101130/sapi/cli/php _ENV["HOME"] => /home/lars _ENV["SHLVL"] => 4 _ENV["LOGNAME"] => lars _ENV["WINDOW"] => 2 _ENV["SSH_CONNECTION"] => deleted _ENV["CC"] => gcc PHP License This program is free software; you can redistribute it and/or modify it under the terms of the PHP License as published by the PHP Group and included in the distribution in the file: LICENSE This program is distributed in the hope that it will be useful, but WITHOUT ANY WARRANTY; without even the implied warranty of MERCHANTABILITY or FITNESS FOR A PARTICULAR PURPOSE. If you did not receive a copy of the PHP license, or have any questions about PHP licensing, please contact license@php.net.

« previous php.qa.reports (#13147) next »