Test results for 5.3.0alpha3-dev [failed]

From: Date: Mon, 10 Nov 2008 20:00:13 +0000
Subject: Test results for 5.3.0alpha3-dev [failed]
Groups: php.qa.reports 
Request: Send a blank email to php-qa-reports+get-13149@lists.php.net to get a copy of this message
===================================================================== FAILED TEST SUMMARY --------------------------------------------------------------------- Ensure that ArrayObject acts like an array [tests/classes/arrayobject_001.phpt] Bug #45392 (ob_start()/ob_end_clean() and memory_limit) [tests/lang/bug45392.phpt] Bug #35634 (Erroneous "Class declarations may not be nested" error raised) [Zend/tests/bug35634.phpt] Testing parameter type-hinted with default value inside namespace [Zend/tests/ns_070.phpt] Testing parameter type-hinted (array) with default value inside namespace [Zend/tests/ns_071.phpt] Testing parameter type-hinted with interface [Zend/tests/ns_072.phpt] Testing type-hinted lambda parameter inside namespace [Zend/tests/ns_073.phpt] Testing type-hinted lambda parameter inside namespace [Zend/tests/ns_074.phpt] Bug #42082 (NodeList length zero should be empty) [ext/dom/tests/bug42082.phpt] Gettext basic test [ext/gettext/tests/gettext_basic.phpt] Phar::mapPhar truncated manifest (not enough for manifest length) [ext/phar/tests/008.phpt] Phar::mapPhar too many manifest entries [ext/phar/tests/009.phpt] Phar::mapPhar buffer overrun [ext/phar/tests/010.phpt] Phar::mapPhar filesize too small in manifest [ext/phar/tests/011.phpt] Phar::loadPhar [ext/phar/tests/028.phpt] Phar: copy-on-write test 1 [cache_list] [ext/phar/tests/cache_list/copyonwrite1.phar.phpt] Phar: copy-on-write test 10 [cache_list] [ext/phar/tests/cache_list/copyonwrite10.phar.phpt] Phar: copy-on-write test 11 [cache_list] [ext/phar/tests/cache_list/copyonwrite11.phar.phpt] Phar: copy-on-write test 12 [cache_list] [ext/phar/tests/cache_list/copyonwrite12.phar.phpt] Phar: copy-on-write test 13 [cache_list] [ext/phar/tests/cache_list/copyonwrite13.phar.phpt] Phar: copy-on-write test 14 [cache_list] [ext/phar/tests/cache_list/copyonwrite14.phar.phpt] Phar: copy-on-write test 15 [cache_list] [ext/phar/tests/cache_list/copyonwrite15.phar.phpt] Phar: copy-on-write test 16 [cache_list] [ext/phar/tests/cache_list/copyonwrite16.phar.phpt] Phar: copy-on-write test 17 [cache_list] [ext/phar/tests/cache_list/copyonwrite17.phar.phpt] Phar: copy-on-write test 18 [cache_list] [ext/phar/tests/cache_list/copyonwrite18.phar.phpt] Phar: copy-on-write test 19 [cache_list] [ext/phar/tests/cache_list/copyonwrite19.phar.phpt] Phar: copy-on-write test 2 [cache_list] [ext/phar/tests/cache_list/copyonwrite2.phar.phpt] Phar: copy-on-write test 20 [cache_list] [ext/phar/tests/cache_list/copyonwrite20.phar.phpt] Phar: copy-on-write test 21 [cache_list] [ext/phar/tests/cache_list/copyonwrite21.phar.phpt] Phar: copy-on-write test 22 [cache_list] [ext/phar/tests/cache_list/copyonwrite22.phar.phpt] Phar: copy-on-write test 23 [cache_list] [ext/phar/tests/cache_list/copyonwrite23.phar.phpt] Phar: copy-on-write test 24 [cache_list] [ext/phar/tests/cache_list/copyonwrite24.phar.phpt] Phar: copy-on-write test 25 [cache_list] [ext/phar/tests/cache_list/copyonwrite25.phar.phpt] Phar: copy-on-write test 3 [cache_list] [ext/phar/tests/cache_list/copyonwrite3.phar.phpt] Phar: copy-on-write test 4 [cache_list] [ext/phar/tests/cache_list/copyonwrite4.phar.phpt] Phar: copy-on-write test 5 [cache_list] [ext/phar/tests/cache_list/copyonwrite5.phar.phpt] Phar: copy-on-write test 6 [cache_list] [ext/phar/tests/cache_list/copyonwrite6.phar.phpt] Phar: copy-on-write test 7 [cache_list] [ext/phar/tests/cache_list/copyonwrite7.phar.phpt] Phar: copy-on-write test 8 [cache_list] [ext/phar/tests/cache_list/copyonwrite8.phar.phpt] Phar: copy-on-write test 9 [cache_list] [ext/phar/tests/cache_list/copyonwrite9.phar.phpt] Phar front controller $_SERVER munging failure [cache_list] [ext/phar/tests/cache_list/frontcontroller18.phpt] Phar front controller $_SERVER munging failure 2 [cache_list] [ext/phar/tests/cache_list/frontcontroller19.phpt] Phar front controller $_SERVER munging failure 3 [cache_list] [ext/phar/tests/cache_list/frontcontroller20.phpt] Phar front controller with weird SCRIPT_NAME [cache_list] [ext/phar/tests/cache_list/frontcontroller30.phpt] Phar: test file_get_contents() interception [ext/phar/tests/file_get_contents.phpt] Phar: test fopen() interception [ext/phar/tests/fopen.phpt] Phar front controller $_SERVER munging failure [ext/phar/tests/frontcontroller18.phpt] Phar front controller $_SERVER munging failure 2 [ext/phar/tests/frontcontroller19.phpt] Phar front controller $_SERVER munging failure 3 [ext/phar/tests/frontcontroller20.phpt] Phar front controller with weird SCRIPT_NAME [ext/phar/tests/frontcontroller30.phpt] Phar: include_path advanced code coverage test [ext/phar/tests/include_path_advanced.phpt] Phar: mounted manifest directory test [ext/phar/tests/mounteddir.phpt] Phar: test opendir() interception [ext/phar/tests/opendir.phpt] Phar: bzipped phar [ext/phar/tests/phar_bz2.phpt] Phar: gzipped phar [ext/phar/tests/phar_gzip.phpt] Phar: include/fopen magic [ext/phar/tests/phar_magic.phpt] Phar: Phar::mount [ext/phar/tests/phar_mount.phpt] Phar: test readfile() interception [ext/phar/tests/readfile.phpt] Phar: test to ensure phar.readonly cannot be circumvented [ext/phar/tests/security.phpt] Phar: test stat function interceptions [ext/phar/tests/stat.phpt] Phar: phar run with pecl/phar with default stub [ext/phar/tests/withphar.phpt] Phar: a non-executable zip with no stub named .phar.zip [ext/phar/tests/zip/notphar.phpt] pspell basic tests (warning: may fail with pspell/aspell < GNU Aspell 0.50.3) [ext/pspell/tests/001.phpt] SPL: FilesystemIterator and foreach [ext/spl/tests/dit_003.phpt] Sort with SORT_LOCALE_STRING [ext/standard/tests/array/locale_sort.phpt] Test gethostbynamel() function : error conditions [ext/standard/tests/network/gethostbynamel_error.phpt] highlight_file() and output buffer [ext/standard/tests/strings/006.phpt] ===================================================================== ===================================================================== EXPECTED FAILED TEST SUMMARY --------------------------------------------------------------------- Inconsistencies when accessing protected members [Zend/tests/access_modifiers_008.phpt] Inconsistencies when accessing protected members - 2 [Zend/tests/access_modifiers_009.phpt] Test restore_error_handler() function : bug #46196 [Zend/tests/bug46196.phpt] SimpleXML: array casting bug [ext/simplexml/tests/034.phpt] ===================================================================== ===================================================================== TEST RESULT SUMMARY --------------------------------------------------------------------- Exts skipped : 42 Exts tested : 35 --------------------------------------------------------------------- Number of tests : 8065 5706 Tests skipped : 2359 ( 29.2%) -------- Tests warned : 0 ( 0.0%) ( 0.0%) Tests failed : 67 ( 0.8%) ( 1.2%) Expected fail : 4 ( 0.0%) ( 0.1%) Tests passed : 5635 ( 69.9%) ( 98.8%) --------------------------------------------------------------------- Time taken : 353 seconds ===================================================================== ===================================================================== FAILED TEST SUMMARY --------------------------------------------------------------------- Ensure that ArrayObject acts like an array [tests/classes/arrayobject_001.phpt] Bug #45392 (ob_start()/ob_end_clean() and memory_limit) [tests/lang/bug45392.phpt] Bug #35634 (Erroneous "Class declarations may not be nested" error raised) [Zend/tests/bug35634.phpt] Testing parameter type-hinted with default value inside namespace [Zend/tests/ns_070.phpt] Testing parameter type-hinted (array) with default value inside namespace [Zend/tests/ns_071.phpt] Testing parameter type-hinted with interface [Zend/tests/ns_072.phpt] Testing type-hinted lambda parameter inside namespace [Zend/tests/ns_073.phpt] Testing type-hinted lambda parameter inside namespace [Zend/tests/ns_074.phpt] Bug #42082 (NodeList length zero should be empty) [ext/dom/tests/bug42082.phpt] Gettext basic test [ext/gettext/tests/gettext_basic.phpt] Phar::mapPhar truncated manifest (not enough for manifest length) [ext/phar/tests/008.phpt] Phar::mapPhar too many manifest entries [ext/phar/tests/009.phpt] Phar::mapPhar buffer overrun [ext/phar/tests/010.phpt] Phar::mapPhar filesize too small in manifest [ext/phar/tests/011.phpt] Phar::loadPhar [ext/phar/tests/028.phpt] Phar: copy-on-write test 1 [cache_list] [ext/phar/tests/cache_list/copyonwrite1.phar.phpt] Phar: copy-on-write test 10 [cache_list] [ext/phar/tests/cache_list/copyonwrite10.phar.phpt] Phar: copy-on-write test 11 [cache_list] [ext/phar/tests/cache_list/copyonwrite11.phar.phpt] Phar: copy-on-write test 12 [cache_list] [ext/phar/tests/cache_list/copyonwrite12.phar.phpt] Phar: copy-on-write test 13 [cache_list] [ext/phar/tests/cache_list/copyonwrite13.phar.phpt] Phar: copy-on-write test 14 [cache_list] [ext/phar/tests/cache_list/copyonwrite14.phar.phpt] Phar: copy-on-write test 15 [cache_list] [ext/phar/tests/cache_list/copyonwrite15.phar.phpt] Phar: copy-on-write test 16 [cache_list] [ext/phar/tests/cache_list/copyonwrite16.phar.phpt] Phar: copy-on-write test 17 [cache_list] [ext/phar/tests/cache_list/copyonwrite17.phar.phpt] Phar: copy-on-write test 18 [cache_list] [ext/phar/tests/cache_list/copyonwrite18.phar.phpt] Phar: copy-on-write test 19 [cache_list] [ext/phar/tests/cache_list/copyonwrite19.phar.phpt] Phar: copy-on-write test 2 [cache_list] [ext/phar/tests/cache_list/copyonwrite2.phar.phpt] Phar: copy-on-write test 20 [cache_list] [ext/phar/tests/cache_list/copyonwrite20.phar.phpt] Phar: copy-on-write test 21 [cache_list] [ext/phar/tests/cache_list/copyonwrite21.phar.phpt] Phar: copy-on-write test 22 [cache_list] [ext/phar/tests/cache_list/copyonwrite22.phar.phpt] Phar: copy-on-write test 23 [cache_list] [ext/phar/tests/cache_list/copyonwrite23.phar.phpt] Phar: copy-on-write test 24 [cache_list] [ext/phar/tests/cache_list/copyonwrite24.phar.phpt] Phar: copy-on-write test 25 [cache_list] [ext/phar/tests/cache_list/copyonwrite25.phar.phpt] Phar: copy-on-write test 3 [cache_list] [ext/phar/tests/cache_list/copyonwrite3.phar.phpt] Phar: copy-on-write test 4 [cache_list] [ext/phar/tests/cache_list/copyonwrite4.phar.phpt] Phar: copy-on-write test 5 [cache_list] [ext/phar/tests/cache_list/copyonwrite5.phar.phpt] Phar: copy-on-write test 6 [cache_list] [ext/phar/tests/cache_list/copyonwrite6.phar.phpt] Phar: copy-on-write test 7 [cache_list] [ext/phar/tests/cache_list/copyonwrite7.phar.phpt] Phar: copy-on-write test 8 [cache_list] [ext/phar/tests/cache_list/copyonwrite8.phar.phpt] Phar: copy-on-write test 9 [cache_list] [ext/phar/tests/cache_list/copyonwrite9.phar.phpt] Phar front controller $_SERVER munging failure [cache_list] [ext/phar/tests/cache_list/frontcontroller18.phpt] Phar front controller $_SERVER munging failure 2 [cache_list] [ext/phar/tests/cache_list/frontcontroller19.phpt] Phar front controller $_SERVER munging failure 3 [cache_list] [ext/phar/tests/cache_list/frontcontroller20.phpt] Phar front controller with weird SCRIPT_NAME [cache_list] [ext/phar/tests/cache_list/frontcontroller30.phpt] Phar: test file_get_contents() interception [ext/phar/tests/file_get_contents.phpt] Phar: test fopen() interception [ext/phar/tests/fopen.phpt] Phar front controller $_SERVER munging failure [ext/phar/tests/frontcontroller18.phpt] Phar front controller $_SERVER munging failure 2 [ext/phar/tests/frontcontroller19.phpt] Phar front controller $_SERVER munging failure 3 [ext/phar/tests/frontcontroller20.phpt] Phar front controller with weird SCRIPT_NAME [ext/phar/tests/frontcontroller30.phpt] Phar: include_path advanced code coverage test [ext/phar/tests/include_path_advanced.phpt] Phar: mounted manifest directory test [ext/phar/tests/mounteddir.phpt] Phar: test opendir() interception [ext/phar/tests/opendir.phpt] Phar: bzipped phar [ext/phar/tests/phar_bz2.phpt] Phar: gzipped phar [ext/phar/tests/phar_gzip.phpt] Phar: include/fopen magic [ext/phar/tests/phar_magic.phpt] Phar: Phar::mount [ext/phar/tests/phar_mount.phpt] Phar: test readfile() interception [ext/phar/tests/readfile.phpt] Phar: test to ensure phar.readonly cannot be circumvented [ext/phar/tests/security.phpt] Phar: test stat function interceptions [ext/phar/tests/stat.phpt] Phar: phar run with pecl/phar with default stub [ext/phar/tests/withphar.phpt] Phar: a non-executable zip with no stub named .phar.zip [ext/phar/tests/zip/notphar.phpt] pspell basic tests (warning: may fail with pspell/aspell < GNU Aspell 0.50.3) [ext/pspell/tests/001.phpt] SPL: FilesystemIterator and foreach [ext/spl/tests/dit_003.phpt] Sort with SORT_LOCALE_STRING [ext/standard/tests/array/locale_sort.phpt] Test gethostbynamel() function : error conditions [ext/standard/tests/network/gethostbynamel_error.phpt] highlight_file() and output buffer [ext/standard/tests/strings/006.phpt] ===================================================================== ===================================================================== EXPECTED FAILED TEST SUMMARY --------------------------------------------------------------------- Inconsistencies when accessing protected members [Zend/tests/access_modifiers_008.phpt] Inconsistencies when accessing protected members - 2 [Zend/tests/access_modifiers_009.phpt] Test restore_error_handler() function : bug #46196 [Zend/tests/bug46196.phpt] SimpleXML: array casting bug [ext/simplexml/tests/034.phpt] ===================================================================== ================================================================================ /Users/tony/src/php/php5.3-200811101930/tests/classes/arrayobject_001.phpt ================================================================================ Warning: reset() expects parameter 1 to be array, object given in /Users/tony/src/php/php5.3-200811101930/tests/classes/arrayobject_001.php on line 5 1 Warning: current() expects parameter 1 to be array, object given in /Users/tony/src/php/php5.3-200811101930/tests/classes/arrayobject_001.php on line 7 ================================================================================ 001+ Warning: reset() expects parameter 1 to be array, object given in /Users/tony/src/php/php5.3-200811101930/tests/classes/arrayobject_001.php on line 5 001- bar1bar 002+ 1 003+ Warning: current() expects parameter 1 to be array, object given in /Users/tony/src/php/php5.3-200811101930/tests/classes/arrayobject_001.php on line 7 ================================================================================ ================================================================================ /Users/tony/src/php/php5.3-200811101930/tests/lang/bug45392.phpt ================================================================================ 2 Fatal error: Allowed memory size of 262144 bytes exhausted (tried to allocate 204801 bytes) in /Users/tony/src/php/php5.3-200811101930/tests/lang/bug45392.php on line 9 ================================================================================ 003- 5 ================================================================================ ================================================================================ /Users/tony/src/php/php5.3-200811101930/Zend/tests/bug35634.phpt ================================================================================ ================================================================================ 001+ 001- Error: Redefining already defined constructor for class TestClass (%sbug35634.php:12) ================================================================================ ================================================================================ /Users/tony/src/php/php5.3-200811101930/Zend/tests/ns_070.phpt ================================================================================ Fatal error: Default value for parameters with a class type hint can only be NULL in /Users/tony/src/php/php5.3-200811101930/Zend/tests/ns_070.php on line 6 ================================================================================ 001+ Fatal error: Default value for parameters with a class type hint can only be NULL in /Users/tony/src/php/php5.3-200811101930/Zend/tests/ns_070.php on line 6 001- object(stdClass)#%d (0) { 002- } 003- NULL ================================================================================ ================================================================================ /Users/tony/src/php/php5.3-200811101930/Zend/tests/ns_071.phpt ================================================================================ Fatal error: Default value for parameters with array type hint can only be an array or NULL in /Users/tony/src/php/php5.3-200811101930/Zend/tests/ns_071.php on line 6 ================================================================================ 001+ Fatal error: Default value for parameters with array type hint can only be an array or NULL in /Users/tony/src/php/php5.3-200811101930/Zend/tests/ns_071.php on line 6 001- NULL 002- 003- Catchable fatal error: Argument 1 passed to foo\bar::__construct() must be an array, object given, called in %s on line %d and defined in %s on line %d ================================================================================ ================================================================================ /Users/tony/src/php/php5.3-200811101930/Zend/tests/ns_072.phpt ================================================================================ Fatal error: Default value for parameters with a class type hint can only be NULL in /Users/tony/src/php/php5.3-200811101930/Zend/tests/ns_072.php on line 10 ================================================================================ 001+ Fatal error: Default value for parameters with a class type hint can only be NULL in /Users/tony/src/php/php5.3-200811101930/Zend/tests/ns_072.php on line 10 001- object(foo\test)#%d (0) { 002- } 003- NULL 004- 005- Catchable fatal error: Argument 1 passed to foo\bar::__construct() must implement interface foo\foo, instance of stdClass given, called in %s on line %d and defined in %s on line %d ================================================================================ ================================================================================ /Users/tony/src/php/php5.3-200811101930/Zend/tests/ns_073.phpt ================================================================================ Fatal error: Default value for parameters with a class type hint can only be NULL in /Users/tony/src/php/php5.3-200811101930/Zend/tests/ns_073.php on line 5 ================================================================================ 001+ Fatal error: Default value for parameters with a class type hint can only be NULL in /Users/tony/src/php/php5.3-200811101930/Zend/tests/ns_073.php on line 5 001- NULL 002- object(stdClass)#%d (0) { 003- } 004- object(stdClass)#%d (0) { 005- } ================================================================================ ================================================================================ /Users/tony/src/php/php5.3-200811101930/Zend/tests/ns_074.phpt ================================================================================ Fatal error: Default value for parameters with a class type hint can only be NULL in /Users/tony/src/php/php5.3-200811101930/Zend/tests/ns_074.php on line 5 ================================================================================ 001+ Fatal error: Default value for parameters with a class type hint can only be NULL in /Users/tony/src/php/php5.3-200811101930/Zend/tests/ns_074.php on line 5 001- NULL 002- object(foo\stdClass)#%d (0) { 003- } 004- object(foo\stdClass)#%d (0) { 005- } ================================================================================ ================================================================================ /Users/tony/src/php/php5.3-200811101930/ext/dom/tests/bug42082.phpt ================================================================================ Warning: DOMXPath::query(): Invalid or inclomplete context in /Users/tony/src/php/php5.3-200811101930/ext/dom/tests/bug42082.php on line 4 bool(false) Notice: Trying to get property of non-object in /Users/tony/src/php/php5.3-200811101930/ext/dom/tests/bug42082.php on line 6 NULL Notice: Trying to get property of non-object in /Users/tony/src/php/php5.3-200811101930/ext/dom/tests/bug42082.php on line 7 bool(true) bool(true) string(0) "" bool(true) bool(true) bool(false) bool(false) ================================================================================ 001+ Warning: DOMXPath::query(): Invalid or inclomplete context in /Users/tony/src/php/php5.3-200811101930/ext/dom/tests/bug42082.php on line 4 002+ bool(false) 003+ 004+ Notice: Trying to get property of non-object in /Users/tony/src/php/php5.3-200811101930/ext/dom/tests/bug42082.php on line 6 005+ NULL 006+ 007+ Notice: Trying to get property of non-object in /Users/tony/src/php/php5.3-200811101930/ext/dom/tests/bug42082.php on line 7 001- object(DOMNodeList)#%d (0) { 002- } 003- int(0) ================================================================================ ================================================================================ /Users/tony/src/php/php5.3-200811101930/ext/gettext/tests/gettext_basic.phpt ================================================================================ Basic test Basic test ================================================================================ 001+ Basic test 002+ Basic test 001- Perustesti 002- Perustesti ================================================================================ ================================================================================ /Users/tony/src/php/php5.3-200811101930/ext/phar/tests/008.phpt ================================================================================ ================================================================================ 001+ 001- internal corruption of phar "%s" (truncated manifest header) ================================================================================ ================================================================================ /Users/tony/src/php/php5.3-200811101930/ext/phar/tests/009.phpt ================================================================================ ================================================================================ 001+ 001- internal corruption of phar "%s009.phar.php" (too many manifest entries for size of manifest) ================================================================================ ================================================================================ /Users/tony/src/php/php5.3-200811101930/ext/phar/tests/010.phpt ================================================================================ Warning: file_get_contents(phar://hio/a): failed to open stream: phar error: no directory in "phar://hio/a", must have at least phar://hio/a/ for root directory (always use full path to a new phar) in /Users/tony/src/php/php5.3-200811101930/ext/phar/tests/010.php on line 14 ================================================================================ 001+ Warning: file_get_contents(phar://hio/a): failed to open stream: phar error: no directory in "phar://hio/a", must have at least phar://hio/a/ for root directory (always use full path to a new phar) in /Users/tony/src/php/php5.3-200811101930/ext/phar/tests/010.php on line 14 001- internal corruption of phar "%s" (too many manifest entries for size of manifest) ================================================================================ ================================================================================ /Users/tony/src/php/php5.3-200811101930/ext/phar/tests/011.phpt ================================================================================ Warning: file_get_contents(phar://hio/a): failed to open stream: phar error: no directory in "phar://hio/a", must have at least phar://hio/a/ for root directory (always use full path to a new phar) in /Users/tony/src/php/php5.3-200811101930/ext/phar/tests/011.php on line 15 ================================================================================ 001+ Warning: file_get_contents(phar://hio/a): failed to open stream: phar error: no directory in "phar://hio/a", must have at least phar://hio/a/ for root directory (always use full path to a new phar) in /Users/tony/src/php/php5.3-200811101930/ext/phar/tests/011.php on line 15 001- internal corruption of phar "%s" (compressed and uncompressed size does not match for uncompressed entry) ================================================================================ ================================================================================ /Users/tony/src/php/php5.3-200811101930/ext/phar/tests/028.phpt ================================================================================ ====== This is a This is b This is b/c This is b/d This is e ===DONE=== ================================================================================ 001- This is a 002- This is b 003- This is b/c 004- This is b/d 005- This is e ================================================================================ ================================================================================ /Users/tony/src/php/php5.3-200811101930/ext/phar/tests/cache_list/copyonwrite1.phar.phpt ================================================================================ ================================================================================ 001+ 001- hi 002- changed 003- ok ================================================================================ ================================================================================ /Users/tony/src/php/php5.3-200811101930/ext/phar/tests/cache_list/copyonwrite10.phar.phpt ================================================================================ ================================================================================ 001+ 001- string(214) "<?php 002- $p = new Phar(__FILE__); 003- var_dump($p->getStub()); 004- $p2 = new Phar(__FILE__); 005- $a = fopen("phar://" . __FILE__ . "/test.txt", "r"); 006- $p->setStub($a); 007- echo $p2->getStub(),"\n"; 008- echo "ok\n"; 009- __HALT_COMPILER(); ?> 010- " 011- <?php __HALT_COMPILER(); ?> 012- 013- ok ================================================================================ ================================================================================ /Users/tony/src/php/php5.3-200811101930/ext/phar/tests/cache_list/copyonwrite11.phar.phpt ================================================================================ ================================================================================ 001+ 001- string(174) "<?php 002- $p = new Phar(__FILE__); 003- var_dump($p->getStub()); 004- $p2 = new Phar(__FILE__); 005- $p->setDefaultStub(); 006- echo strlen($p2->getStub()),"\n"; 007- echo "ok\n"; 008- __HALT_COMPILER(); ?> 009- " 010- 6685 011- ok ================================================================================ ================================================================================ /Users/tony/src/php/php5.3-200811101930/ext/phar/tests/cache_list/copyonwrite12.phar.phpt ================================================================================ ================================================================================ 001+ 001- array(2) { 002- ["hash"]=> 003- string(40) "0163F471460EA74F7636268D28289BF5A1E8BD72" 004- ["hash_type"]=> 005- string(5) "SHA-1" 006- } 007- array(2) { 008- ["hash"]=> 009- string(32) "%s" 010- ["hash_type"]=> 011- string(3) "MD5" 012- } 013- ok ================================================================================ ================================================================================ /Users/tony/src/php/php5.3-200811101930/ext/phar/tests/cache_list/copyonwrite13.phar.phpt ================================================================================ ================================================================================ 001+ 001- bool(false) 002- bool(true) 003- ok ================================================================================ ================================================================================ /Users/tony/src/php/php5.3-200811101930/ext/phar/tests/cache_list/copyonwrite14.phar.phpt ================================================================================ ================================================================================ 001+ 001- bool(true) 002- bool(false) 003- ok ================================================================================ ================================================================================ /Users/tony/src/php/php5.3-200811101930/ext/phar/tests/cache_list/copyonwrite15.phar.phpt ================================================================================ ================================================================================ 001+ 001- bool(false) 002- bool(true) 003- ok ================================================================================ ================================================================================ /Users/tony/src/php/php5.3-200811101930/ext/phar/tests/cache_list/copyonwrite16.phar.phpt ================================================================================ ================================================================================ 001+ 001- bool(true) 002- bool(false) 003- ok ================================================================================ ================================================================================ /Users/tony/src/php/php5.3-200811101930/ext/phar/tests/cache_list/copyonwrite17.phar.phpt ================================================================================ ================================================================================ 001+ 001- NULL 002- string(2) "hi" 003- ok ================================================================================ ================================================================================ /Users/tony/src/php/php5.3-200811101930/ext/phar/tests/cache_list/copyonwrite18.phar.phpt ================================================================================ ================================================================================ 001+ 001- 100666 002- 100444 003- ok ================================================================================ ================================================================================ /Users/tony/src/php/php5.3-200811101930/ext/phar/tests/cache_list/copyonwrite19.phar.phpt ================================================================================ ================================================================================ 001+ 001- string(2) "hi" 002- string(3) "hi2" 003- ok ================================================================================ ================================================================================ /Users/tony/src/php/php5.3-200811101930/ext/phar/tests/cache_list/copyonwrite2.phar.phpt ================================================================================ ================================================================================ 001+ 001- string(2) "hi" 002- bool(true) 003- string(2) "hi" 004- bool(true) 005- bool(true) 006- ok ================================================================================ ================================================================================ /Users/tony/src/php/php5.3-200811101930/ext/phar/tests/cache_list/copyonwrite20.phar.phpt ================================================================================ ================================================================================ 001+ 001- string(2) "hi" 002- NULL 003- ok ================================================================================ ================================================================================ /Users/tony/src/php/php5.3-200811101930/ext/phar/tests/cache_list/copyonwrite21.phar.phpt ================================================================================ ================================================================================ 001+ 001- bool(false) 002- bool(true) 003- ok ================================================================================ ================================================================================ /Users/tony/src/php/php5.3-200811101930/ext/phar/tests/cache_list/copyonwrite22.phar.phpt ================================================================================ ================================================================================ 001+ 001- bool(true) 002- bool(false) 003- ok ================================================================================ ================================================================================ /Users/tony/src/php/php5.3-200811101930/ext/phar/tests/cache_list/copyonwrite23.phar.phpt ================================================================================ ================================================================================ 001+ 001- bool(true) 002- bool(false) 003- bool(false) 004- bool(true) 005- ok ================================================================================ ================================================================================ /Users/tony/src/php/php5.3-200811101930/ext/phar/tests/cache_list/copyonwrite24.phar.phpt ================================================================================ ================================================================================ 001+ 001- bool(false) 002- bool(true) 003- ok ================================================================================ ================================================================================ /Users/tony/src/php/php5.3-200811101930/ext/phar/tests/cache_list/copyonwrite25.phar.phpt ================================================================================ ================================================================================ 001+ 001- bool(false) 002- bool(true) 003- <?php __HALT_COMPILER(); 004- ok ================================================================================ ================================================================================ /Users/tony/src/php/php5.3-200811101930/ext/phar/tests/cache_list/copyonwrite3.phar.phpt ================================================================================ ================================================================================ 001+ 001- bool(true) 002- bool(true) 003- bool(false) 004- bool(false) 005- ok ================================================================================ ================================================================================ /Users/tony/src/php/php5.3-200811101930/ext/phar/tests/cache_list/copyonwrite4.phar.phpt ================================================================================ ================================================================================ 001+ 001- bool(false) 002- bool(true) 003- string(2) "hi" 004- ok ================================================================================ ================================================================================ /Users/tony/src/php/php5.3-200811101930/ext/phar/tests/cache_list/copyonwrite5.phar.phpt ================================================================================ ================================================================================ 001+ 001- array(2) { 002- ["file1"]=> 003- string(%d) "%sfile1" 004- ["file2"]=> 005- string(%d) "%sfile2" 006- } 007- phar://%scopyonwrite5.phar.php%cfile1 file1 008- phar://%scopyonwrite5.phar.php%cfile2 file2 009- phar://%scopyonwrite5.phar.php%chi hi 010- ok ================================================================================ ================================================================================ /Users/tony/src/php/php5.3-200811101930/ext/phar/tests/cache_list/copyonwrite6.phar.phpt ================================================================================ ================================================================================ 001+ 001- array(2) { 002- ["file1"]=> 003- string(%d) "%sfile1" 004- ["file2"]=> 005- string(%d) "%sfile2" 006- } 007- phar://%scopyonwrite6.phar.php%cfile1 file1 008- phar://%scopyonwrite6.phar.php%cfile2 file2 009- phar://%scopyonwrite6.phar.php%chi hi 010- ok ================================================================================ ================================================================================ /Users/tony/src/php/php5.3-200811101930/ext/phar/tests/cache_list/copyonwrite7.phar.phpt ================================================================================ ================================================================================ 001+ 001- bool(true) 002- bool(false) 003- ok ================================================================================ ================================================================================ /Users/tony/src/php/php5.3-200811101930/ext/phar/tests/cache_list/copyonwrite8.phar.phpt ================================================================================ ================================================================================ 001+ 001- string(%s) "%scopyonwrite8.phar.php" 002- hi 003- ok ================================================================================ ================================================================================ /Users/tony/src/php/php5.3-200811101930/ext/phar/tests/cache_list/copyonwrite9.phar.phpt ================================================================================ ================================================================================ 001+ 001- string(188) "<?php 002- $p = new Phar(__FILE__); 003- var_dump($p->getStub()); 004- $p2 = new Phar(__FILE__); 005- $p->setStub("<?php __HALT"."_COMPILER();"); 006- echo $p2->getStub(),"\n"; 007- echo "ok\n"; 008- __HALT_COMPILER(); ?> 009- " 010- <?php __HALT_COMPILER(); ?> 011- 012- ok ================================================================================ ================================================================================ /Users/tony/src/php/php5.3-200811101930/ext/phar/tests/cache_list/frontcontroller18.phpt ================================================================================ ================================================================================ 001+ 001- Fatal error: Uncaught exception 'PharException' with message 'No values passed to Phar::mungServer(), expecting an array of any of these strings: PHP_SELF, REQUEST_URI, SCRIPT_FILENAME, SCRIPT_NAME' in %sfrontcontroller18.php:2 002- Stack trace: 003- #0 %sfrontcontroller18.php(2): Phar::mungServer(Array) 004- #1 {main} 005- thrown in %sfrontcontroller18.php on line 2 ================================================================================ ================================================================================ /Users/tony/src/php/php5.3-200811101930/ext/phar/tests/cache_list/frontcontroller19.phpt ================================================================================ ================================================================================ 001+ 001- Fatal error: Uncaught exception 'PharException' with message 'Too many values passed to Phar::mungServer(), expecting an array of any of these strings: PHP_SELF, REQUEST_URI, SCRIPT_FILENAME, SCRIPT_NAME' in %sfrontcontroller19.php:2 002- Stack trace: 003- #0 %sfrontcontroller19.php(2): Phar::mungServer(Array) 004- #1 {main} 005- thrown in %sfrontcontroller19.php on line 2 ================================================================================ ================================================================================ /Users/tony/src/php/php5.3-200811101930/ext/phar/tests/cache_list/frontcontroller20.phpt ================================================================================ ================================================================================ 001+ 001- Fatal error: Uncaught exception 'PharException' with message 'Non-string value passed to Phar::mungServer(), expecting an array of any of these strings: PHP_SELF, REQUEST_URI, SCRIPT_FILENAME, SCRIPT_NAME' in %sfrontcontroller20.php:2 002- Stack trace: 003- #0 %sfrontcontroller20.php(2): Phar::mungServer(Array) 004- #1 {main} 005- thrown in %sfrontcontroller20.php on line 2 ================================================================================ ================================================================================ /Users/tony/src/php/php5.3-200811101930/ext/phar/tests/cache_list/frontcontroller30.phpt ================================================================================ ================================================================================ 001+ 001- oops did not run 002- %a ================================================================================ ================================================================================ /Users/tony/src/php/php5.3-200811101930/ext/phar/tests/file_get_contents.phpt ================================================================================ ===DONE=== ================================================================================ 001+ ===DONE=== 001- hihi===DONE=== ================================================================================ ================================================================================ /Users/tony/src/php/php5.3-200811101930/ext/phar/tests/fopen.phpt ================================================================================ Warning: fopen() expects at least 2 parameters, 0 given in /Users/tony/src/php/php5.3-200811101930/ext/phar/tests/fopen.php on line 5 ===DONE=== ================================================================================ 002- hihi 003- Warning: fopen(notfound.txt): failed to open stream: No such file or directory in phar://%sfopen.phar.php/index.php on line %d ================================================================================ ================================================================================ /Users/tony/src/php/php5.3-200811101930/ext/phar/tests/frontcontroller18.phpt ================================================================================ ================================================================================ 001+ 001- Fatal error: Uncaught exception 'PharException' with message 'No values passed to Phar::mungServer(), expecting an array of any of these strings: PHP_SELF, REQUEST_URI, SCRIPT_FILENAME, SCRIPT_NAME' in %sfrontcontroller18.php:2 002- Stack trace: 003- #0 %sfrontcontroller18.php(2): Phar::mungServer(Array) 004- #1 {main} 005- thrown in %sfrontcontroller18.php on line 2 ================================================================================ ================================================================================ /Users/tony/src/php/php5.3-200811101930/ext/phar/tests/frontcontroller19.phpt ================================================================================ ================================================================================ 001+ 001- Fatal error: Uncaught exception 'PharException' with message 'Too many values passed to Phar::mungServer(), expecting an array of any of these strings: PHP_SELF, REQUEST_URI, SCRIPT_FILENAME, SCRIPT_NAME' in %sfrontcontroller19.php:2 002- Stack trace: 003- #0 %sfrontcontroller19.php(2): Phar::mungServer(Array) 004- #1 {main} 005- thrown in %sfrontcontroller19.php on line 2 ================================================================================ ================================================================================ /Users/tony/src/php/php5.3-200811101930/ext/phar/tests/frontcontroller20.phpt ================================================================================ ================================================================================ 001+ 001- Fatal error: Uncaught exception 'PharException' with message 'Non-string value passed to Phar::mungServer(), expecting an array of any of these strings: PHP_SELF, REQUEST_URI, SCRIPT_FILENAME, SCRIPT_NAME' in %sfrontcontroller20.php:2 002- Stack trace: 003- #0 %sfrontcontroller20.php(2): Phar::mungServer(Array) 004- #1 {main} 005- thrown in %sfrontcontroller20.php on line 2 ================================================================================ ================================================================================ /Users/tony/src/php/php5.3-200811101930/ext/phar/tests/frontcontroller30.phpt ================================================================================ ================================================================================ 001+ 001- oops did not run 002- %a ================================================================================ ================================================================================ /Users/tony/src/php/php5.3-200811101930/ext/phar/tests/include_path_advanced.phpt ================================================================================ ================================================================================ 001+ 001- file1.php 002- test/file1.php 003- ok ================================================================================ ================================================================================ /Users/tony/src/php/php5.3-200811101930/ext/phar/tests/mounteddir.phpt ================================================================================ string(73) "/Users/tony/src/php/php5.3-200811101930/ext/phar/tests/testit/extfile.php" existing.txt phar:///Users/tony/src/php/php5.3-200811101930/ext/phar/tests/tempmanifest1.phar.php/testit/existing.txt Mounting of /testit to another\..\mistake within phar /Users/tony/src/php/php5.3-200811101930/ext/phar/tests/tempmanifest1.phar.php failed Mounting of /notfound to /Users/tony/src/php/php5.3-200811101930/ext/phar/tests/this/does/not/exist within phar /Users/tony/src/php/php5.3-200811101930/ext/phar/tests/tempmanifest1.phar.php failed ===DONE=== ================================================================================ 002+ existing.txt 003+ phar:///Users/tony/src/php/php5.3-200811101930/ext/phar/tests/tempmanifest1.phar.php/testit/existing.txt 004+ Mounting of /testit to another\..\mistake within phar /Users/tony/src/php/php5.3-200811101930/ext/phar/tests/tempmanifest1.phar.php failed 005+ Mounting of /notfound to /Users/tony/src/php/php5.3-200811101930/ext/phar/tests/this/does/not/exist within phar /Users/tony/src/php/php5.3-200811101930/ext/phar/tests/tempmanifest1.phar.php failed 006+ ===DONE=== 002- <?php 003- var_dump(__FILE__); 004- ?> 005- 006- Warning: file_get_contents(phar://%stempmanifest1.phar.php/testit/directory): failed to open stream: phar error: path "testit/directory" is a directory in phar://%stempmanifest1.phar.php/index.php on line %d 007- 008- oops 009- string(%d) "phar://%sextfile.php" 010- string(%d) "phar://%sextfile2.php" 011- Mounting of .phar/stub.php to %sextfile.php within phar %stests/tempmanifest1.phar.php failed 012- . 013- .. 014- directory 015- extfile.php 016- extfile2.php 017- phar://%stempmanifest1.phar.php/testit%cdirectory 018- phar://%stempmanifest1.phar.php/testit%cextfile.php 019- phar://%stempmanifest1.phar.php/testit%cextfile2.php 020- Mounting of /testit to another\..\mistake within phar %stempmanifest1.phar.php failed 021- Mounting of /notfound to %stests/this/does/not/exist within phar %stempmanifest1.phar.php failed 022- Mounting of /testit to %stests within phar %stests/tempmanifest1.phar.php failed 023- Mounting of /testit/extfile.php to %stests within phar %stests/tempmanifest1.phar.php failed 024- ===DONE=== ================================================================================ ================================================================================ /Users/tony/src/php/php5.3-200811101930/ext/phar/tests/opendir.phpt ================================================================================ Warning: opendir(phar://): failed to open dir: phar error: no directory in "phar://", must have at least phar:/// for root directory (always use full path to a new phar) phar url "phar://" is unknown in /Users/tony/src/php/php5.3-200811101930/ext/phar/tests/opendir.php on line 22 Warning: opendir(phar://hi.phar): failed to open dir: phar error: invalid url or non-existent phar "phar://hi.phar" phar url "phar://hi.phar" is unknown in /Users/tony/src/php/php5.3-200811101930/ext/phar/tests/opendir.php on line 23 ===DONE=== ================================================================================ 001- file1.txtfile2.txtfile3.txt 002- ================================================================================ ================================================================================ /Users/tony/src/php/php5.3-200811101930/ext/phar/tests/phar_bz2.phpt ================================================================================ bool(true) bool(true) Warning: Phar::isFileFormat() expects parameter 1 to be long, array given in /Users/tony/src/php/php5.3-200811101930/ext/phar/tests/phar_bz2.php on line 32 Unknown file format specified ===DONE=== ================================================================================ 001- string(9) "it worked" 002- string(%d) "phar://%sphar_bz2.phar/tar_004.php" ================================================================================ ================================================================================ /Users/tony/src/php/php5.3-200811101930/ext/phar/tests/phar_gzip.phpt ================================================================================ bool(true) bool(true) ===DONE=== ================================================================================ 001- string(9) "it worked" 002- string(%d) "phar://%sphar_gzip.phar/tar_004.php" ================================================================================ ================================================================================ /Users/tony/src/php/php5.3-200811101930/ext/phar/tests/phar_magic.phpt ================================================================================ ===DONE=== ================================================================================ 001- in b 002- <?php include "b/c.php"; 003- in d ================================================================================ ================================================================================ /Users/tony/src/php/php5.3-200811101930/ext/phar/tests/phar_mount.phpt ================================================================================ Mounting of testit to /Users/tony/src/php/php5.3-200811101930/ext/phar/tests/phar_mount.php within phar /Users/tony/src/php/php5.3-200811101930/ext/phar/tests/phar_mount.phar.tar failed Can only mount internal paths within a phar archive, use a relative path instead of "phar:///Users/tony/src/php/php5.3-200811101930/ext/phar/tests/phar_mount.phar.php/testit1" Mounting of /oops to /home/oops/../../etc/passwd: within phar /Users/tony/src/php/php5.3-200811101930/ext/phar/tests/phar_mount.phar.php failed <?php $fname = dirname(__FILE__) . '/' . basename( ===DONE=== ================================================================================ 001+ Mounting of testit to /Users/tony/src/php/php5.3-200811101930/ext/phar/tests/phar_mount.php within phar /Users/tony/src/php/php5.3-200811101930/ext/phar/tests/phar_mount.phar.tar failed 001- Mounting of testit to %sphar_mount.php within phar %sphar_mount.phar.php failed 003- Mounting of testit to %sphar_mount.php within phar %sphar_mount.phar.tar failed ================================================================================ ================================================================================ /Users/tony/src/php/php5.3-200811101930/ext/phar/tests/readfile.phpt ================================================================================ ===DONE=== ================================================================================ 001+ ===DONE=== 001- hihi===DONE=== ================================================================================ ================================================================================ /Users/tony/src/php/php5.3-200811101930/ext/phar/tests/security.phpt ================================================================================ ===DONE=== ================================================================================ 001- bool(false) 002- Write operations disabled by INI setting ================================================================================ ================================================================================ /Users/tony/src/php/php5.3-200811101930/ext/phar/tests/stat.phpt ================================================================================ bool(false) ===DONE=== ================================================================================ 002+ ===DONE=== 002- stat 003- array(26) { 004- [0]=> 005- int(12) 006- [1]=> 007- int(%d) 008- [2]=> 009- int(33206) 010- [3]=> 011- int(1) 012- [4]=> 013- int(0) 014- [5]=> 015- int(0) 016- [6]=> 017- int(%s) 018- [7]=> 019- int(2) 020- [8]=> 021- int(%d) 022- [9]=> 023- int(%d) 024- [10]=> 025- int(%d) 026- [11]=> 027- int(%s) 028- [12]=> 029- int(%s) 030- ["dev"]=> 031- int(12) 032- ["ino"]=> 033- int(%d) 034- ["mode"]=> 035- int(33206) 036- ["nlink"]=> 037- int(1) 038- ["uid"]=> 039- int(0) 040- ["gid"]=> 041- int(0) 042- ["rdev"]=> 043- int(%s) 044- ["size"]=> 045- int(2) 046- ["atime"]=> 047- int(%d) 048- ["mtime"]=> 049- int(%d) 050- ["ctime"]=> 051- int(%d) 052- ["blksize"]=> 053- int(%s) 054- ["blocks"]=> 055- int(%s) 056- } 057- lstat 058- array(26) { 059- [0]=> 060- int(12) 061- [1]=> 062- int(%d) 063- [2]=> 064- int(33206) 065- [3]=> 066- int(1) 067- [4]=> 068- int(0) 069- [5]=> 070- int(0) 071- [6]=> 072- int(%s) 073- [7]=> 074- int(2) 075- [8]=> 076- int(%d) 077- [9]=> 078- int(%d) 079- [10]=> 080- int(%d) 081- [11]=> 082- int(%s) 083- [12]=> 084- int(%s) 085- ["dev"]=> 086- int(12) 087- ["ino"]=> 088- int(%d) 089- ["mode"]=> 090- int(33206) 091- ["nlink"]=> 092- int(1) 093- ["uid"]=> 094- int(0) 095- ["gid"]=> 096- int(0) 097- ["rdev"]=> 098- int(%s) 099- ["size"]=> 100- int(2) 101- ["atime"]=> 102- int(%d) 103- ["mtime"]=> 104- int(%d) 105- ["ctime"]=> 106- int(%d) 107- ["blksize"]=> 108- int(%s) 109- ["blocks"]=> 110- int(%s) 111- } 112- fileperms 113- int(33206) 114- fileinode 115- int(%d) 116- filesize 117- int(2) 118- fileowner 119- int(0) 120- filegroup 121- int(0) 122- filemtime 123- int(%d) 124- fileatime 125- int(%d) 126- filectime 127- int(%d) 128- filetype 129- string(4) "file" 130- is_writable 131- bool(true) 132- is_writeable 133- bool(false) 134- is_readable 135- bool(true) 136- is_executable 137- bool(false) 138- file_exists 139- bool(true) 140- is_dir 141- bool(false) 142- is_file 143- bool(true) 144- is_link 145- bool(false) 146- not found 147- bool(false) 148- not found 2 149- 150- Warning: fileperms(): stat failed for not/found in phar://%sstat.phar.php/my/index.php on line %d 151- bool(false) 152- ===DONE=== ================================================================================ ================================================================================ /Users/tony/src/php/php5.3-200811101930/ext/phar/tests/withphar.phpt ================================================================================ ===DONE=== ================================================================================ 001- in b 002- <?php include "b/c.php"; 003- in d ================================================================================ ================================================================================ /Users/tony/src/php/php5.3-200811101930/ext/phar/tests/zip/notphar.phpt ================================================================================ Warning: include(phar:///Users/tony/src/php/php5.3-200811101930/ext/phar/tests/zip/notphar.phar.zip/.phar/stub.php): failed to open stream: '/Users/tony/src/php/php5.3-200811101930/ext/phar/tests/zip/notphar.phar.zip' is not a phar archive. Use PharData::__construct() for a standard zip or tar archive in /Users/tony/src/php/php5.3-200811101930/ext/phar/tests/zip/notphar.php on line 6 ===DONE=== ================================================================================ 002+ ===DONE=== 002- PK%a ================================================================================ ================================================================================ /Users/tony/src/php/php5.3-200811101930/ext/pspell/tests/001.phpt ================================================================================ I : true will : true not : true buy : true this : true record : true it : true is : true scratched : true Sorry : true I : true will : true not : true buy : true this : true record : true it : true is : true scratched : true Uh : true no : true no : true no : true This : true is : true a : true tobacconists : true Ah : true I : true will : true not : true buy : true this : true tobacconists : true it : true is : true scratched : true No : true no : true no : true no : true Tobacco : true um : true cigarettes : true holds : true up : true a : true pack : true Ya : true Seegarets : ..false Possible spellings: Seegare ts,Seegare-ts,Secrets,Regrets,Secretes,Egrets,Segre's,Sucrets,Segregates,Sergeants,Sugariest,Garrets,Socrates,Egret's,Separates,Securest,Squarest,Margaret's,Carets,Scares,Secret,Sectaries,Sergeant's,Garret's,Seurat's,Caret's,Skeet's Ya : true Uh : true My : true hovercraft : true is : true full : true of : true eels : true Sorry : true My : true hovercraft : true pantomimes : true puffing : true a : true cigarette : true is : true full : true of : true eels : true pretends : true to : true strike : true a : true match : true Ahh : ..false Possible spellings: Shh,Ah,Aha,Aah,Ash matches : true ================================================================================ 051+ Possible spellings: Seegare ts,Seegare-ts,Secrets,Regrets,Secretes,Egrets,Segre's,Sucrets,Segregates,Sergeants,Sugariest,Garrets,Socrates,Egret's,Separates,Securest,Squarest,Margaret's,Carets,Scares,Secret,Sectaries,Sergeant's,Garret's,Seurat's,Caret's,Skeet's 051- Possible spellings:%s,Regrets,%s,Cigarettes,%s ================================================================================ ================================================================================ /Users/tony/src/php/php5.3-200811101930/ext/spl/tests/dit_003.phpt ================================================================================ Fatal error: Uncaught exception 'UnexpectedValueException' with message 'FilesystemIterator::__construct(CVS): failed to open dir: No such file or directory' in /Users/tony/src/php/php5.3-200811101930/ext/spl/tests/dit_003.php:3 Stack trace: #0 /Users/tony/src/php/php5.3-200811101930/ext/spl/tests/dit_003.php(3): FilesystemIterator->__construct('CVS') #1 {main} thrown in /Users/tony/src/php/php5.3-200811101930/ext/spl/tests/dit_003.php on line 3 ================================================================================ 001+ Fatal error: Uncaught exception 'UnexpectedValueException' with message 'FilesystemIterator::__construct(CVS): failed to open dir: No such file or directory' in /Users/tony/src/php/php5.3-200811101930/ext/spl/tests/dit_003.php:3 002+ Stack trace: 001- bool(true) 002- ===DONE=== 003+ #0 /Users/tony/src/php/php5.3-200811101930/ext/spl/tests/dit_003.php(3): FilesystemIterator->__construct('CVS') 004+ #1 {main} 005+ thrown in /Users/tony/src/php/php5.3-200811101930/ext/spl/tests/dit_003.php on line 3 ================================================================================ ================================================================================ /Users/tony/src/php/php5.3-200811101930/ext/standard/tests/array/locale_sort.phpt ================================================================================ array(13) { ["AB"]=> string(7) "Alberta" ["BC"]=> string(20) "Colombie-Britannique" ["MB"]=> string(8) "Manitoba" ["NB"]=> string(17) "Nouveau-Brunswick" ["NS"]=> string(15) "Nouvelle-Écosse" ["NU"]=> string(7) "Nunavut" ["ON"]=> string(7) "Ontario" ["QC"]=> string(6) "Québec" ["SK"]=> string(12) "Saskatchewan" ["NL"]=> string(23) "Terre-Neuve-et-Labrador" ["YT"]=> string(19) "Territoire du Yukon" ["NT"]=> string(25) "Territoires du Nord-Ouest" ["PE"]=> string(21) "Île-du-Prince-Édouard" } ================================================================================ 006- ["PE"]=> 007- string(21) "Île-du-Prince-Édouard" 026+ ["PE"]=> 027+ string(21) "Île-du-Prince-Édouard" ================================================================================ ================================================================================ /Users/tony/src/php/php5.3-200811101930/ext/standard/tests/network/gethostbynamel_error.phpt ================================================================================ *** Testing gethostbynamel() : error conditions *** -- Testing gethostbynamel() function with Zero arguments -- Warning: gethostbynamel() expects exactly 1 parameter, 0 given in /Users/tony/src/php/php5.3-200811101930/ext/standard/tests/network/gethostbynamel_error.php on line 12 NULL -- Testing gethostbynamel() function with more than expected no. of arguments -- Warning: gethostbynamel() expects exactly 1 parameter, 2 given in /Users/tony/src/php/php5.3-200811101930/ext/standard/tests/network/gethostbynamel_error.php on line 18 NULL -- Testing gethostbynamel() with an unknown host -- array(1) { [0]=> string(13) "208.69.36.132" } Done ================================================================================ 014+ array(1) { 015+ [0]=> 016+ string(13) "208.69.36.132" 017+ } 014- bool(false) ================================================================================ ================================================================================ /Users/tony/src/php/php5.3-200811101930/ext/standard/tests/strings/006.phpt ================================================================================ Warning: highlight_file(AAAAAAAAAAAAAAAAAAAAAAAAAAAAAAAAAAAAAAAAAAAAAAAAAAAAAAAAAAAAAAAAAAAAAAAAAAAAAAAAAAAAAAAAAAAAAAAAAAAAAAAAAAAAAAAAAAAAAAAAAAAAAAAAAAAAAAAAAAAAAAAAAAAAAAAAAAAAAAAAAAAAAAAAAAAAAAAAAAAAAAAAAAAAAAAAAAAAAAAAAAAAAAAAAAAAAAAAAAAAAAAAAAAAAAAAAAAAAAAAAAAAAAAAAAAAAAAAAAAAAAAAAAAAAAAAAAAAAAAAAAAAAAAAAAAAAAAAAAAAAAAAAAAAAAAAAAAAAAAAAAAAAAAAAAAAAAAAAAAAAAAAAAAAAAAAAAAAAAAAAAAAAAAAAAAAAAAAAAAAAAAAAAAAAAAAAAAAAAAAAAAAAAAAAAAAAAAAAAAAAAAAAAAAAAAAAAAAAAAAAAAAAAAAAAAAAAAAAAAAAAAAAAAAAAAAAAAAAAAAAAAAAAAAAAAAAAAAAAAAAAAAAAAAAAAAAAAAAAAAAAAAAAAAAAAAAAAAAAAAAAAAAAAAAAAAAAAAAAAAAAAAAAAAAAAAAAAAAAAAAAAAAAAAAAAAAAAAAAAAAAAAAAAAAAAAAAAAAAAAAAAAAAAAAAAAAAAAAAAAAAAAAAAAAAAAAAAAAAAAAAAAAAAAAAAAAAAAAAAAAAAAAAAAAAAAAAAAAAAAAAAAAAAAAAAAAAAAAAAAAAAAAAAAAAAAAAAAAAAAAAAAAAAAAAAAAAAAAAAAAAAAAAAAAAAAAAAAAAAAAAAAAAAAAAAAAAAAAAAAAAAAAAAAAAAAAAAAAAAAAAAAAAAAAAAAAAAAAAAAAAAAAAAAAAAAAAAAAAAAAAAAAAAAAAAAAAAAAAAAAAAAAAAAAAAAAAAAAAAAAAAAAAAAAAAAAAAAAAAAAAAAAAAAAAAAAAAAAAAAAAAAAAAAAAAAAAAAAAAAAAAAA! AAAAAAAAAAAAAAAAAAAAAAAAAAAAAAAAAAAAAAAAAAAAAAAAAAAAAAAAAAA): failed to open stream: Inappropriate ioctl for device in /Users/tony/src/php/php5.3-200811101930/ext/standard/tests/strings/006.php on line 5 Warning: highlight_file(): Failed opening 'AAAAAAAAAAAAAAAAAAAAAAAAAAAAAAAAAAAAAAAAAAAAAAAAAAAAAAAAAAAAAAAAAAAAAAAAAAAAAAAAAAAAAAAAAAAAAAAAAAAAAAAAAAAAAAAAAAAAAAAAAAAAAAAAAAAAAAAAAAAAAAAAAAAAAAAAAAAAAAAAAAAAAAAAAAAAAAAAAAAAAAAAAAAAAAAAAAAAAAAAAAAAAAAAAAAAAAAAAAAAAAAAAAAAAAAAAAAAAAAAAAAAAAAAAAAAAAAAAAAAAAAAAAAAAAAAAAAAAAAAAAAAAAAAAAAAAAAAAAAAAAAAAAAAAAAAAAAAAAAAAAAAAAAAAAAAAAAAAAAAAAAAAAAAAAAAAAAAAAAAAAAAAAAAAAAAAAAAAAAAAAAAAAAAAAAAAAAAAAAAAAAAAAAAAAAAAAAAAAAAAAAAAAAAAAAAAAAAAAAAAAAAAAAAAAAAAAAAAAAAAAAAAAAAAAAAAAAAAAAAAAAAAAAAAAAAAAAAAAAAAAAAAAAAAAAAAAAAAAAAAAAAAAAAAAAAAAAAAAAAAAAAAAAAAAAAAAAAAAAAAAAAAAAAAAAAAAAAAAAAAAAAAAAAAAAAAAAAAAAAAAAAAAAAAAAAAAAAAAAAAAAAAAAAAAAAAAAAAAAAAAAAAAAAAAAAAAAAAAAAAAAAAAAAAAAAAAAAAAAAAAAAAAAAAAAAAAAAAAAAAAAAAAAAAAAAAAAAAAAAAAAAAAAAAAAAAAAAAAAAAAAAAAAAAAAAAAAAAAAAAAAAAAAAAAAAAAAAAAAAAAAAAAAAAAAAAAAAAAAAAAAAAAAAAAAAAAAAAAAAAAAAAAAAAAAAAAAAAAAAAAAAAAAAAAAAAAAAAAAAAAAAAAAAAAAAAAAAAAAAAAAAAAAAAAAAAAAAAAAAAAAAAAAAAAAAAAAAAAAAAAAAAAAAAAAAAAAAAAAAAAAAAA! AAAAAAAAAAAAAAAAAAAAAAAAAAAAAAAAAAAAAAAAAAAAAAAAAAAAAAAAAAAAAAAAAAAAAAAAAAAAAA' for highlighting in /Users/tony/src/php/php5.3-200811101930/ext/standard/tests/strings/006.php on line 5 bool(false) bool(false) ===DONE=== ================================================================================ 001+ Warning: highlight_file(AAAAAAAAAAAAAAAAAAAAAAAAAAAAAAAAAAAAAAAAAAAAAAAAAAAAAAAAAAAAAAAAAAAAAAAAAAAAAAAAAAAAAAAAAAAAAAAAAAAAAAAAAAAAAAAAAAAAAAAAAAAAAAAAAAAAAAAAAAAAAAAAAAAAAAAAAAAAAAAAAAAAAAAAAAAAAAAAAAAAAAAAAAAAAAAAAAAAAAAAAAAAAAAAAAAAAAAAAAAAAAAAAAAAAAAAAAAAAAAAAAAAAAAAAAAAAAAAAAAAAAAAAAAAAAAAAAAAAAAAAAAAAAAAAAAAAAAAAAAAAAAAAAAAAAAAAAAAAAAAAAAAAAAAAAAAAAAAAAAAAAAAAAAAAAAAAAAAAAAAAAAAAAAAAAAAAAAAAAAAAAAAAAAAAAAAAAAAAAAAAAAAAAAAAAAAAAAAAAAAAAAAAAAAAAAAAAAAAAAAAAAAAAAAAAAAAAAAAAAAAAAAAAAAAAAAAAAAAAAAAAAAAAAAAAAAAAAAAAAAAAAAAAAAAAAAAAAAAAAAAAAAAAAAAAAAAAAAAAAAAAAAAAAAAAAAAAAAAAAAAAAAAAAAAAAAAAAAAAAAAAAAAAAAAAAAAAAAAAAAAAAAAAAAAAAAAAAAAAAAAAAAAAAAAAAAAAAAAAAAAAAAAAAAAAAAAAAAAAAAAAAAAAAAAAAAAAAAAAAAAAAAAAAAAAAAAAAAAAAAAAAAAAAAAAAAAAAAAAAAAAAAAAAAAAAAAAAAAAAAAAAAAAAAAAAAAAAAAAAAAAAAAAAAAAAAAAAAAAAAAAAAAAAAAAAAAAAAAAAAAAAAAAAAAAAAAAAAAAAAAAAAAAAAAAAAAAAAAAAAAAAAAAAAAAAAAAAAAAAAAAAAAAAAAAAAAAAAAAAAAAAAAAAAAAAAAAAAAAAAAAAAAAAAAAAAAAAAAAAAAAAAAAAAAAAAAAAAAAAAAAAAAAAAAAAAAAAAAAAA! AAAAAAAAAAAAAAAAAAAAAAAAAAAAAAAAAAAAAAAAAAAAAAAAAAAAAAAAAAAAAAAA): failed to open stream: Inappropriate ioctl for device in /Users/tony/src/php/php5.3-200811101930/ext/standard/tests/strings/006.php on line 5 001- Warning: highlight_file(AAAAAAAAAAAAAAAAAAAAAAAAAAAAAAAAAAAAAAAAAAAAAAAAAAAAAAAAAAAAAAAAAAAAAAAAAAAAAAAAAAAAAAAAAAAAAAAAAAAAAAAAAAAAAAAAAAAAAAAAAAAAAAAAAAAAAAAAAAAAAAAAAAAAAAAAAAAAAAAAAAAAAAAAAAAAAAAAAAAAAAAAAAAAAAAAAAAAAAAAAAAAAAAAAAAAAAAAAAAAAAAAAAAAAAAAAAAAAAAAAAAAAAAAAAAAAAAAAAAAAAAAAAAAAAAAAAAAAAAAAAAAAAAAAAAAAAAAAAAAAAAAAAAAAAAAAAAAAAAAAAAAAAAAAAAAAAAAAAAAAAAAAAAAAAAAAAAAAAAAAAAAAAAAAAAAAAAAAAAAAAAAAAAAAAAAAAAAAAAAAAAAAAAAAAAAAAAAAAAAAAAAAAAAAAAAAAAAAAAAAAAAAAAAAAAAAAAAAAAAAAAAAAAAAAAAAAAAAAAAAAAAAAAAAAAAAAAAAAAAAAAAAAAAAAAAAAAAAAAAAAAAAAAAAAAAAAAAAAAAAAAAAAAAAAAAAAAAAAAAAAAAAAAAAAAAAAAAAAAAAAAAAAAAAAAAAAAAAAAAAAAAAAAAAAAAAAAAAAAAAAAAAAAAAAAAAAAAAAAAAAAAAAAAAAAAAAAAAAAAAAAAAAAAAAAAAAAAAAAAAAAAAAAAAAAAAAAAAAAAAAAAAAAAAAAAAAAAAAAAAAAAAAAAAAAAAAAAAAAAAAAAAAAAAAAAAAAAAAAAAAAAAAAAAAAAAAAAAAAAAAAAAAAAAAAAAAAAAAAAAAAAAAAAAAAAAAAAAAAAAAAAAAAAAAAAAAAAAAAAAAAAAAAAAAAAAAAAAAAAAAAAAAAAAAAAAAAAAAAAAAAAAAAAAAAAAAAAAAAAAAAAAAAAAAAAAAAAAAAAAAAAAAAAAAAAAAAAAAAAAAAAAAAAAAAAAAAAAAAA! AAAAAAAAAAAAAAAAAAAAAAAAAAAAAAAAAAAAAAAAAAAAAAAAAAAAAAAAAAAAAAAA): failed to open stream: File name too long in %s006.php on line %d ================================================================================ ================================================================================ BUILD ENVIRONMENT ================================================================================ OS: Darwin - Darwin Peckinpah 9.5.0 Darwin Kernel Version 9.5.0: Wed Sep 3 11:29:43 PDT 2008; root:xnu-1228.7.58~1/RELEASE_I386 i386 Autoconf: autoconf (GNU Autoconf) 2.61 Copyright (C) 2006 Free Software Foundation, Inc. This is free software. You may redistribute copies of it under the terms of the GNU General Public License <http://www.gnu.org/licenses/gpl.html>. There is NO WARRANTY, to the extent permitted by law. Written by David J. MacKenzie and Akim Demaille. Bundled Libtool: ltmain.sh (GNU libtool) 1.5.20 (1.1220.2.287 2005/08/31 18:54:15) Copyright (C) 2005 Free Software Foundation, Inc. This is free software; see the source for copying conditions. There is NO warranty; not even for MERCHANTABILITY or FITNESS FOR A PARTICULAR PURPOSE. System Libtool: ltmain.sh (GNU libtool) 1.5.22 (1.1220.2.365 2005/12/18 22:14:06) Copyright (C) 2005 Free Software Foundation, Inc. This is free software; see the source for copying conditions. There is NO warranty; not even for MERCHANTABILITY or FITNESS FOR A PARTICULAR PURPOSE. Compiler: Using built-in specs. Target: i686-apple-darwin9 Configured with: /var/tmp/gcc/gcc-5465~16/src/configure --disable-checking -enable-werror --prefix=/usr --mandir=/share/man --enable-languages=c,objc,c++,obj-c++ --program-transform-name=/^[cg][^.-]*$/s/$/-4.0/ --with-gxx-include-dir=/include/c++/4.0.0 --with-slibdir=/usr/lib --build=i686-apple-darwin9 --with-arch=apple --with-tune=generic --host=i686-apple-darwin9 --target=i686-apple-darwin9 Thread model: posix gcc version 4.0.1 (Apple Inc. build 5465) Bison: bison (GNU Bison) 2.3 Written by Robert Corbett and Richard Stallman. Copyright (C) 2006 Free Software Foundation, Inc. This is free software; see the source for copying conditions. There is NO warranty; not even for MERCHANTABILITY or FITNESS FOR A PARTICULAR PURPOSE. Libraries: User's E-mail: anthony dot reed at gmail dot com ================================================================================ PHPINFO ================================================================================ phpinfo() PHP Version => 5.3.0alpha3-dev System => Darwin Peckinpah 9.5.0 Darwin Kernel Version 9.5.0: Wed Sep 3 11:29:43 PDT 2008; root:xnu-1228.7.58~1/RELEASE_I386 i386 Build Date => Nov 10 2008 14:51:20 Configure Command => './configure' '--prefix=/Users/tony/php5.3' '--with-apxs2=/Users/tony/apache2/bin/apxs' '--with-gd' '--with-jpeg-dir=/usr/local' '--with-png-dir=/usr/X11' '--with-gettext=/usr/local' '--with-freetype-dir=/usr/X11' '--with-xpm-dir=/usr/X11' '--with-zlib-dir=/usr' '--with-openssl=/usr' '--with-pspell' '--with-bz2' '--enable-calendar' '--enable-exif' '--enable-ftp' '--enable-zend-multibyte' Server API => Command Line Interface Virtual Directory Support => disabled Configuration File (php.ini) Path => /Users/tony/php5.3/lib Loaded Configuration File => /Users/tony/php5.3/lib/php.ini Scan this dir for additional .ini files => (none) additional .ini files parsed => (none) PHP API => 20041225 PHP Extension => 20071006 Zend Extension => 220070929 Debug Build => no Thread Safety => disabled Zend Memory Manager => enabled Zend Multibyte Support => enabled IPv6 Support => enabled Registered PHP Streams => php, file, glob, data, http, ftp, compress.bzip2, https, ftps, compress.zlib, phar Registered Stream Socket Transports => tcp, udp, unix, udg, ssl, sslv3, sslv2, tls Registered Stream Filters => string.rot13, string.toupper, string.tolower, string.strip_tags, convert.*, consumed, bzip2.*, convert.iconv.*, zlib.* This program makes use of the Zend Scripting Language Engine: Zend Engine v2.3.0, Copyright (c) 1998-2008 Zend Technologies _______________________________________________________________________ Configuration PHP Core Directive => Local Value => Master Value allow_call_time_pass_reference => Off => Off allow_url_fopen => On => On allow_url_include => Off => Off always_populate_raw_post_data => Off => Off arg_separator.input => & => & arg_separator.output => & => & asp_tags => Off => Off auto_append_file => no value => no value auto_globals_jit => On => On auto_prepend_file => no value => no value browscap => no value => no value default_charset => no value => no value default_mimetype => text/html => text/html define_syslog_variables => Off => Off detect_unicode => On => On disable_classes => no value => no value disable_functions => no value => no value display_errors => STDERR => STDERR display_startup_errors => Off => Off doc_root => no value => no value docref_ext => no value => no value docref_root => no value => no value enable_dl => On => On error_append_string => no value => no value error_log => no value => no value error_prepend_string => no value => no value error_reporting => 30719 => 30719 exit_on_timeout => Off => Off expose_php => On => On extension_dir => /Users/tony/php5.3/lib/php/extensions/no-debug-non-zts-20071006 => /Users/tony/php5.3/lib/php/extensions/no-debug-non-zts-20071006 file_uploads => On => On highlight.bg => <font style="color: #FFFFFF">#FFFFFF</font> => <font style="color: #FFFFFF">#FFFFFF</font> highlight.comment => <font style="color: #FF8000">#FF8000</font> => <font style="color: #FF8000">#FF8000</font> highlight.default => <font style="color: #0000BB">#0000BB</font> => <font style="color: #0000BB">#0000BB</font> highlight.html => <font style="color: #000000">#000000</font> => <font style="color: #000000">#000000</font> highlight.keyword => <font style="color: #007700">#007700</font> => <font style="color: #007700">#007700</font> highlight.string => <font style="color: #DD0000">#DD0000</font> => <font style="color: #DD0000">#DD0000</font> html_errors => Off => Off ignore_repeated_errors => Off => Off ignore_repeated_source => Off => Off ignore_user_abort => Off => Off implicit_flush => On => On include_path => .:/Users/tony/php5.3/lib/php => .:/Users/tony/php5.3/lib/php log_errors => On => On log_errors_max_len => 1024 => 1024 magic_quotes_gpc => Off => Off magic_quotes_runtime => Off => Off magic_quotes_sybase => Off => Off mail.force_extra_parameters => no value => no value max_execution_time => 0 => 0 max_input_nesting_level => 64 => 64 max_input_time => -1 => -1 memory_limit => 128M => 128M open_basedir => no value => no value output_buffering => 0 => 0 output_handler => no value => no value post_max_size => 8M => 8M precision => 14 => 14 realpath_cache_size => 16K => 16K realpath_cache_ttl => 120 => 120 register_argc_argv => On => On register_globals => Off => Off register_long_arrays => Off => Off report_memleaks => On => On report_zend_debug => Off => Off request_order => GP => GP safe_mode => Off => Off safe_mode_exec_dir => no value => no value safe_mode_gid => Off => Off safe_mode_include_dir => no value => no value sendmail_from => no value => no value sendmail_path => /usr/sbin/sendmail -t -i => /usr/sbin/sendmail -t -i serialize_precision => 100 => 100 short_open_tag => Off => Off SMTP => localhost => localhost smtp_port => 25 => 25 sql.safe_mode => Off => Off track_errors => Off => Off unserialize_callback_func => no value => no value upload_max_filesize => 2M => 2M upload_tmp_dir => no value => no value user_dir => no value => no value user_ini.cache_ttl => 300 => 300 user_ini.filename => .user.ini => .user.ini variables_order => GPCS => GPCS xmlrpc_error_number => 0 => 0 xmlrpc_errors => Off => Off y2k_compliance => On => On zend.enable_gc => On => On bz2 BZip2 Support => Enabled Stream Wrapper support => compress.bz2:// Stream Filter support => bzip2.decompress, bzip2.compress BZip2 Version => 1.0.4, 20-Dec-2006 calendar Calendar support => enabled ctype ctype functions => enabled date date/time support => enabled "Olson" Timezone Database Version => 2008.9 Timezone Database => internal Default timezone => America/New_York Directive => Local Value => Master Value date.default_latitude => 31.7667 => 31.7667 date.default_longitude => 35.2333 => 35.2333 date.sunrise_zenith => 90.583333 => 90.583333 date.sunset_zenith => 90.583333 => 90.583333 date.timezone => no value => no value dom DOM/XML => enabled DOM/XML API Version => 20031129 libxml Version => 2.6.16 HTML Support => enabled XPath Support => enabled XPointer Support => enabled Schema Support => enabled RelaxNG Support => enabled ereg Regex Library => Bundled library enabled exif EXIF Support => enabled EXIF Version => 1.4 $Id: exif.c,v 1.173.2.5.2.20.2.11 2008/11/02 21:19:31 felipe Exp $ Supported EXIF Version => 0220 Supported filetypes => JPEG,TIFF fileinfo fileinfo support => enabled version => 1.0.5-dev filter Input Validation and Filtering => enabled Revision => $Revision: 1.52.2.39.2.10 $ Directive => Local Value => Master Value filter.default => unsafe_raw => unsafe_raw filter.default_flags => no value => no value ftp FTP support => enabled gd GD Support => enabled GD Version => bundled (2.0.34 compatible) FreeType Support => enabled FreeType Linkage => with freetype FreeType Version => 2.3.5 GIF Read Support => enabled GIF Create Support => enabled JPG Support => enabled libJPEG Version => 62 PNG Support => enabled libPNG Version => 1.2.8 WBMP Support => enabled XPM Support => enabled XBM Support => enabled gettext GetText Support => enabled hash hash support => enabled Hashing Engines => md2 md4 md5 sha1 sha224 sha256 sha384 sha512 ripemd128 ripemd160 ripemd256 ripemd320 whirlpool tiger128,3 tiger160,3 tiger192,3 tiger128,4 tiger160,4 tiger192,4 snefru snefru256 gost adler32 crc32 crc32b haval128,3 haval160,3 haval192,3 haval224,3 haval256,3 haval128,4 haval160,4 haval192,4 haval224,4 haval256,4 haval128,5 haval160,5 haval192,5 haval224,5 haval256,5 iconv iconv support => enabled iconv implementation => libiconv iconv library version => 1.11 Directive => Local Value => Master Value iconv.input_encoding => ISO-8859-1 => ISO-8859-1 iconv.internal_encoding => ISO-8859-1 => ISO-8859-1 iconv.output_encoding => ISO-8859-1 => ISO-8859-1 json json support => enabled json version => 1.2.1 libxml libXML support => active libXML Version => 2.6.16 libXML streams => enabled ming Ming SWF output library => enabled Version => 0.4.2 openssl OpenSSL support => enabled OpenSSL Library Version => OpenSSL 0.9.7l 28 Sep 2006 OpenSSL Header Version => OpenSSL 0.9.7l 28 Sep 2006 pcre PCRE (Perl Compatible Regular Expressions) Support => enabled PCRE Library Version => 7.8 2008-09-05 Directive => Local Value => Master Value pcre.backtrack_limit => 100000 => 100000 pcre.recursion_limit => 100000 => 100000 PDO PDO support => enabled PDO drivers => sqlite2, sqlite pdo_sqlite PDO Driver for SQLite 3.x => enabled SQLite Library => 3.6.2 Phar Phar: PHP Archive support => enabled Phar EXT version => 2.0.0-dev Phar API version => 1.1.1 CVS revision => $Revision: 1.370.2.54 $ Phar-based phar archives => enabled Tar-based phar archives => enabled ZIP-based phar archives => enabled gzip compression => enabled bzip2 compression => enabled OpenSSL support => enabled Phar based on pear/PHP_Archive, original concept by Davey Shafik. Phar fully realized by Gregory Beaver and Marcus Boerger. Portions of tar implementation Copyright (c) 2003-2008 Tim Kientzle. Directive => Local Value => Master Value phar.cache_list => no value => no value phar.readonly => On => On phar.require_hash => On => On posix Revision => $Revision: 1.70.2.3.2.16.2.12 $ pspell PSpell Support => enabled Reflection Reflection => enabled Version => $Id: php_reflection.c,v 1.164.2.33.2.45.2.39 2008/11/04 15:58:55 helly Exp $ session Session Support => enabled Registered save handlers => files user sqlite Registered serializer handlers => php php_binary Directive => Local Value => Master Value session.auto_start => Off => Off session.bug_compat_42 => Off => Off session.bug_compat_warn => On => On session.cache_expire => 180 => 180 session.cache_limiter => nocache => nocache session.cookie_domain => no value => no value session.cookie_httponly => Off => Off session.cookie_lifetime => 0 => 0 session.cookie_path => / => / session.cookie_secure => Off => Off session.entropy_file => no value => no value session.entropy_length => 0 => 0 session.gc_divisor => 1000 => 1000 session.gc_maxlifetime => 1440 => 1440 session.gc_probability => 1 => 1 session.hash_bits_per_character => 5 => 5 session.hash_function => 0 => 0 session.name => PHPSESSID => PHPSESSID session.referer_check => no value => no value session.save_handler => files => files session.save_path => no value => no value session.serialize_handler => php => php session.use_cookies => On => On session.use_only_cookies => On => On session.use_trans_sid => 0 => 0 SimpleXML Simplexml support => enabled Revision => $Revision: 1.151.2.22.2.35.2.26 $ Schema support => enabled SPL SPL support => enabled Interfaces => Countable, OuterIterator, RecursiveIterator, SeekableIterator, SplObserver, SplSubject Classes => AppendIterator, ArrayIterator, ArrayObject, BadFunctionCallException, BadMethodCallException, CachingIterator, DirectoryIterator, DomainException, EmptyIterator, FilesystemIterator, FilterIterator, GlobIterator, InfiniteIterator, InvalidArgumentException, IteratorIterator, LengthException, LimitIterator, LogicException, MultipleIterator, NoRewindIterator, OutOfBoundsException, OutOfRangeException, OverflowException, ParentIterator, RangeException, RecursiveArrayIterator, RecursiveCachingIterator, RecursiveDirectoryIterator, RecursiveFilterIterator, RecursiveIteratorIterator, RecursiveRegexIterator, RecursiveTreeIterator, RegexIterator, RuntimeException, SplDoublyLinkedList, SplFileInfo, SplFileObject, SplFixedArray, SplHeap, SplMinHeap, SplMaxHeap, SplObjectStorage, SplPriorityQueue, SplQueue, SplStack, SplTempFileObject, UnderflowException, UnexpectedValueException SQLite SQLite support => enabled PECL Module version => 2.0-dev $Id: sqlite.c,v 1.166.2.13.2.9.2.14 2008/11/02 21:19:36 felipe Exp $ SQLite Library => 2.8.17 SQLite Encoding => iso8859 Directive => Local Value => Master Value sqlite.assoc_case => 0 => 0 sqlite3 SQLite3 support => enabled SQLite3 module version => 0.7-dev SQLite Library => 3.6.2 Directive => Local Value => Master Value sqlite3.extension_dir => no value => no value standard Dynamic Library Support => enabled Path to sendmail => /usr/sbin/sendmail -t -i Directive => Local Value => Master Value assert.active => 1 => 1 assert.bail => 0 => 0 assert.callback => no value => no value assert.quiet_eval => 0 => 0 assert.warning => 1 => 1 auto_detect_line_endings => 0 => 0 default_socket_timeout => 60 => 60 safe_mode_allowed_env_vars => PHP_ => PHP_ safe_mode_protected_env_vars => LD_LIBRARY_PATH => LD_LIBRARY_PATH url_rewriter.tags => a=href,area=href,frame=src,input=src,form=fakeentry => a=href,area=href,frame=src,input=src,form=fakeentry user_agent => no value => no value tokenizer Tokenizer Support => enabled xml XML Support => active XML Namespace Support => active libxml2 Version => 2.6.16 xmlreader XMLReader => enabled xmlwriter XMLWriter => enabled zlib ZLib Support => enabled Stream Wrapper support => compress.zlib:// Stream Filter support => zlib.inflate, zlib.deflate Compiled Version => 1.2.3 Linked Version => 1.2.3 Directive => Local Value => Master Value zlib.output_compression => Off => Off zlib.output_compression_level => -1 => -1 zlib.output_handler => no value => no value Additional Modules Module Name Environment Variable => Value MANPATH => /usr/share/man:/usr/local/share/man:/usr/X11/man LC_MONETARY => en_US.UTF-8 TERM_PROGRAM => iTerm.app TEST_PHP_SRCDIR => /Users/tony/src/php/php5.3-200811101930 SHELL => /bin/bash TERM => xterm-256color MAKEFLAGS => SSH_CLIENT => deleted TMPDIR => /var/folders/B5/B5ICcG6DFxudbTZezp4ZPE+++TI/-Tmp-/ Apple_PubSub_Socket_Render => /tmp/launch-gp0zM0/Render LC_NUMERIC => en_US.UTF-8 SSH_TTY => deleted ANT_HOME => /Users/tony/src/JAVA/apache-ant-1.7.0 USER => tony COMMAND_MODE => legacy SSH_AUTH_SOCK => deleted __CF_USER_TEXT_ENCODING => 0x1F5:0:0 MAKELEVEL => 1 PAGER => /usr/local/bin/most MFLAGS => PATH => /Users/tony/php5.3/bin:/Users/tony/apache2/bin:/Users/tony/bin:/usr/local/bin:/bin:/sbin:/usr/bin:/usr/sbin:/usr/local/pgsql/bin:/Users/tony/src/JAVA/apache-ant-1.7.0/bin LC_MESSAGES => en_US.UTF-8 _ => /Users/tony/src/php/php5.3-200811101930/sapi/cli/php LC_COLLATE => en_US.UTF-8 PWD => /Users/tony/src/php/php5.3-200811101930 EDITOR => /usr/local/bin/emacs LANG => en_US.UTF-8 TEST_PHP_EXECUTABLE => /Users/tony/src/php/php5.3-200811101930/sapi/cli/php HOME => /Users/tony SHLVL => 3 COLORFGBG => 15;0 TERMINFO => /usr/local/share/terminfo LOGNAME => tony SSH_CONNECTION => deleted LC_CTYPE => en_US.UTF-8 DISPLAY => /tmp/launch-JUQXKI/:0 CC => gcc LC_TIME => en_US.UTF-8 SECURITYSESSIONID => 26d9f060 PHP Variables Variable => Value _SERVER["MANPATH"] => /usr/share/man:/usr/local/share/man:/usr/X11/man _SERVER["LC_MONETARY"] => en_US.UTF-8 _SERVER["TERM_PROGRAM"] => iTerm.app _SERVER["TEST_PHP_SRCDIR"] => /Users/tony/src/php/php5.3-200811101930 _SERVER["SHELL"] => /bin/bash _SERVER["TERM"] => xterm-256color _SERVER["MAKEFLAGS"] => _SERVER["SSH_CLIENT"] => deleted _SERVER["TMPDIR"] => /var/folders/B5/B5ICcG6DFxudbTZezp4ZPE+++TI/-Tmp-/ _SERVER["Apple_PubSub_Socket_Render"] => /tmp/launch-gp0zM0/Render _SERVER["LC_NUMERIC"] => en_US.UTF-8 _SERVER["SSH_TTY"] => deleted _SERVER["ANT_HOME"] => /Users/tony/src/JAVA/apache-ant-1.7.0 _SERVER["USER"] => tony _SERVER["COMMAND_MODE"] => legacy _SERVER["SSH_AUTH_SOCK"] => deleted _SERVER["__CF_USER_TEXT_ENCODING"] => 0x1F5:0:0 _SERVER["MAKELEVEL"] => 1 _SERVER["PAGER"] => /usr/local/bin/most _SERVER["MFLAGS"] => _SERVER["PATH"] => /Users/tony/php5.3/bin:/Users/tony/apache2/bin:/Users/tony/bin:/usr/local/bin:/bin:/sbin:/usr/bin:/usr/sbin:/usr/local/pgsql/bin:/Users/tony/src/JAVA/apache-ant-1.7.0/bin _SERVER["LC_MESSAGES"] => en_US.UTF-8 _SERVER["_"] => /Users/tony/src/php/php5.3-200811101930/sapi/cli/php _SERVER["LC_COLLATE"] => en_US.UTF-8 _SERVER["PWD"] => /Users/tony/src/php/php5.3-200811101930 _SERVER["EDITOR"] => /usr/local/bin/emacs _SERVER["LANG"] => en_US.UTF-8 _SERVER["TEST_PHP_EXECUTABLE"] => /Users/tony/src/php/php5.3-200811101930/sapi/cli/php _SERVER["HOME"] => /Users/tony _SERVER["SHLVL"] => 3 _SERVER["COLORFGBG"] => 15;0 _SERVER["TERMINFO"] => /usr/local/share/terminfo _SERVER["LOGNAME"] => tony _SERVER["SSH_CONNECTION"] => deleted _SERVER["LC_CTYPE"] => en_US.UTF-8 _SERVER["DISPLAY"] => /tmp/launch-JUQXKI/:0 _SERVER["CC"] => gcc _SERVER["LC_TIME"] => en_US.UTF-8 _SERVER["SECURITYSESSIONID"] => 26d9f060 _SERVER["PHP_SELF"] => _SERVER["SCRIPT_NAME"] => _SERVER["SCRIPT_FILENAME"] => _SERVER["PATH_TRANSLATED"] => _SERVER["DOCUMENT_ROOT"] => _SERVER["REQUEST_TIME"] => 1226347218 _SERVER["argv"] => Array ( ) _SERVER["argc"] => 0 PHP License This program is free software; you can redistribute it and/or modify it under the terms of the PHP License as published by the PHP Group and included in the distribution in the file: LICENSE This program is distributed in the hope that it will be useful, but WITHOUT ANY WARRANTY; without even the implied warranty of MERCHANTABILITY or FITNESS FOR A PARTICULAR PURPOSE. If you did not receive a copy of the PHP license, or have any questions about PHP licensing, please contact license@php.net.

« previous php.qa.reports (#13149) next »