PHP Make Test Failure

From: Date: Mon, 09 Sep 2013 19:14:55 +0000
Subject: PHP Make Test Failure
Groups: php.qa.reports 
Request: Send a blank email to php-qa-reports+get-31313@lists.php.net to get a copy of this message
Please see attached log for make test. Thanks, Josh Allmandinger Data Center Operations [6107largeLogo] Desk: 610-747-1613 Cell: 484-343-1644 DC Ops: 610-617-2755 josh.allmandinger@sig.com<mailto:josh.allmandinger@sig.com> ________________________________ IMPORTANT: The information contained in this email and/or its attachments is confidential. If you are not the intended recipient, please notify the sender immediately by reply and immediately delete this message and all its attachments. Any review, use, reproduction, disclosure or dissemination of this message or any attachment by an unintended recipient is strictly prohibited. Neither this message nor any attachment is intended as or should be construed as an offer, solicitation or recommendation to buy or sell any security or other financial instrument. Neither the sender, his or her employer nor any of their respective affiliates makes any warranties as to the completeness or accuracy of any of the information contained herein or that this message or any of its attachments is free of viruses.

===================================================================== EXPECTED FAILED TEST SUMMARY --------------------------------------------------------------------- Test script to verify that magic methods should be called only once when accessing an unset property. [tests/classes/bug63462.phpt] XFAIL REASON: Bug 63462 is not yet fixed Test open_basedir configuration [tests/security/open_basedir_linkinfo.phpt] XFAIL REASON: BUG: open_basedir cannot delete symlink to prohibited file. See also bugs 48111 and 52176. Inconsistencies when accessing protected members [Zend/tests/access_modifiers_008.phpt] XFAIL REASON: Discussion: http://marc.info/?l=php-internals&m=120221184420957&w=2 Inconsistencies when accessing protected members - 2 [Zend/tests/access_modifiers_009.phpt] XFAIL REASON: Discussion: http://marc.info/?l=php-internals&m=120221184420957&w=2 Bug #48770 (call_user_func_array() fails to call parent from inheriting class) [Zend/tests/bug48770.phpt] XFAIL REASON: See Bug #48770 Bug #48770 (call_user_func_array() fails to call parent from inheriting class) [Zend/tests/bug48770_2.phpt] XFAIL REASON: See Bug #48770 Bug #48770 (call_user_func_array() fails to call parent from inheriting class) [Zend/tests/bug48770_3.phpt] XFAIL REASON: See Bug #48770 Bug #63336 (invalid E_NOTICE error occur) [Zend/tests/bug63336.phpt] XFAIL REASON: Bug is not fixed yet Initial value of static var in method depends on the include time of the class definition [Zend/tests/method_static_var.phpt] XFAIL REASON: Maybe not a bug DateTime::add() -- fall type2 type3 [ext/date/tests/DateTime_add-fall-type2-type3.phpt] XFAIL REASON: Various bugs exist DateTime::add() -- fall type3 type2 [ext/date/tests/DateTime_add-fall-type3-type2.phpt] XFAIL REASON: Various bugs exist DateTime::add() -- fall type3 type3 [ext/date/tests/DateTime_add-fall-type3-type3.phpt] XFAIL REASON: Various bugs exist DateTime::add() -- spring type2 type3 [ext/date/tests/DateTime_add-spring-type2-type3.phpt] XFAIL REASON: Various bugs exist DateTime::add() -- spring type3 type2 [ext/date/tests/DateTime_add-spring-type3-type2.phpt] XFAIL REASON: Various bugs exist DateTime::add() -- spring type3 type3 [ext/date/tests/DateTime_add-spring-type3-type3.phpt] XFAIL REASON: Various bugs exist DateTime::diff() -- fall type2 type3 [ext/date/tests/DateTime_diff-fall-type2-type3.phpt] XFAIL REASON: Various bugs exist DateTime::diff() -- fall type3 type2 [ext/date/tests/DateTime_diff-fall-type3-type2.phpt] XFAIL REASON: Various bugs exist DateTime::diff() -- fall type3 type3 [ext/date/tests/DateTime_diff-fall-type3-type3.phpt] XFAIL REASON: Various bugs exist DateTime::diff() -- spring type2 type3 [ext/date/tests/DateTime_diff-spring-type2-type3.phpt] XFAIL REASON: Various bugs exist DateTime::diff() -- spring type3 type2 [ext/date/tests/DateTime_diff-spring-type3-type2.phpt] XFAIL REASON: Various bugs exist DateTime::diff() -- spring type3 type3 [ext/date/tests/DateTime_diff-spring-type3-type3.phpt] XFAIL REASON: Various bugs exist DateTime::sub() -- fall type2 type3 [ext/date/tests/DateTime_sub-fall-type2-type3.phpt] XFAIL REASON: Various bugs exist DateTime::sub() -- fall type3 type2 [ext/date/tests/DateTime_sub-fall-type3-type2.phpt] XFAIL REASON: Various bugs exist DateTime::sub() -- fall type3 type3 [ext/date/tests/DateTime_sub-fall-type3-type3.phpt] XFAIL REASON: Various bugs exist DateTime::sub() -- spring type2 type3 [ext/date/tests/DateTime_sub-spring-type2-type3.phpt] XFAIL REASON: Various bugs exist DateTime::sub() -- spring type3 type2 [ext/date/tests/DateTime_sub-spring-type3-type2.phpt] XFAIL REASON: Various bugs exist DateTime::sub() -- spring type3 type3 [ext/date/tests/DateTime_sub-spring-type3-type3.phpt] XFAIL REASON: Various bugs exist RFC: DateTime and Daylight Saving Time Transitions (zone type 3) [ext/date/tests/rfc-datetime_and_daylight_saving_time-type3.phpt] XFAIL REASON: RFC not implemented yet Bug #42718 (unsafe_raw filter not applied when configured as default filter) [ext/filter/tests/bug42718.phpt] XFAIL REASON: FILTER_UNSAFE_RAW not applied when configured as default filter, even with flags Bug #45712 (NaN/INF comparison) [ext/standard/tests/math/bug45712.phpt] XFAIL REASON: Bug 45712 not fixed yet. ===================================================================== ===================================================================== FAILED TEST SUMMARY --------------------------------------------------------------------- file_get_contents() test using offset parameter out of range [ext/standard/tests/file/file_get_contents_error001.phpt] Test function getservbyname() by substituting argument 2 with emptyUnsetUndefNull values. [ext/standard/tests/general_functions/getservbyname_variation10.phpt] Test function getservbyname() by substituting argument 2 with boolean values. [ext/standard/tests/general_functions/getservbyname_variation9.phpt] Test function getservbyport() by calling it more than or less than its expected arguments [ext/standard/tests/general_functions/getservbyport_variation1.phpt] http-stream test [ext/standard/tests/network/http-stream.phpt] Test setlocale() function : usage variations - Setting all available locales in the platform [ext/standard/tests/strings/setlocale_variation2.phpt] Bug #32001 (xml_parse*() goes into infinite loop when autodetection in effect), using UTF-* [ext/xml/tests/bug32001.phpt] ===================================================================== ===================================================================== TEST RESULT SUMMARY --------------------------------------------------------------------- Exts skipped : 52 Exts tested : 27 --------------------------------------------------------------------- Number of tests : 12825 8568 Tests skipped : 4257 ( 33.2%) -------- Tests warned : 0 ( 0.0%) ( 0.0%) Tests failed : 7 ( 0.1%) ( 0.1%) Expected fail : 30 ( 0.2%) ( 0.4%) Tests passed : 8531 ( 66.5%) ( 99.6%) --------------------------------------------------------------------- Time taken : 448 seconds ===================================================================== ===================================================================== EXPECTED FAILED TEST SUMMARY --------------------------------------------------------------------- Test script to verify that magic methods should be called only once when accessing an unset property. [tests/classes/bug63462.phpt] XFAIL REASON: Bug 63462 is not yet fixed Test open_basedir configuration [tests/security/open_basedir_linkinfo.phpt] XFAIL REASON: BUG: open_basedir cannot delete symlink to prohibited file. See also bugs 48111 and 52176. Inconsistencies when accessing protected members [Zend/tests/access_modifiers_008.phpt] XFAIL REASON: Discussion: http://marc.info/?l=php-internals&m=120221184420957&w=2 Inconsistencies when accessing protected members - 2 [Zend/tests/access_modifiers_009.phpt] XFAIL REASON: Discussion: http://marc.info/?l=php-internals&m=120221184420957&w=2 Bug #48770 (call_user_func_array() fails to call parent from inheriting class) [Zend/tests/bug48770.phpt] XFAIL REASON: See Bug #48770 Bug #48770 (call_user_func_array() fails to call parent from inheriting class) [Zend/tests/bug48770_2.phpt] XFAIL REASON: See Bug #48770 Bug #48770 (call_user_func_array() fails to call parent from inheriting class) [Zend/tests/bug48770_3.phpt] XFAIL REASON: See Bug #48770 Bug #63336 (invalid E_NOTICE error occur) [Zend/tests/bug63336.phpt] XFAIL REASON: Bug is not fixed yet Initial value of static var in method depends on the include time of the class definition [Zend/tests/method_static_var.phpt] XFAIL REASON: Maybe not a bug DateTime::add() -- fall type2 type3 [ext/date/tests/DateTime_add-fall-type2-type3.phpt] XFAIL REASON: Various bugs exist DateTime::add() -- fall type3 type2 [ext/date/tests/DateTime_add-fall-type3-type2.phpt] XFAIL REASON: Various bugs exist DateTime::add() -- fall type3 type3 [ext/date/tests/DateTime_add-fall-type3-type3.phpt] XFAIL REASON: Various bugs exist DateTime::add() -- spring type2 type3 [ext/date/tests/DateTime_add-spring-type2-type3.phpt] XFAIL REASON: Various bugs exist DateTime::add() -- spring type3 type2 [ext/date/tests/DateTime_add-spring-type3-type2.phpt] XFAIL REASON: Various bugs exist DateTime::add() -- spring type3 type3 [ext/date/tests/DateTime_add-spring-type3-type3.phpt] XFAIL REASON: Various bugs exist DateTime::diff() -- fall type2 type3 [ext/date/tests/DateTime_diff-fall-type2-type3.phpt] XFAIL REASON: Various bugs exist DateTime::diff() -- fall type3 type2 [ext/date/tests/DateTime_diff-fall-type3-type2.phpt] XFAIL REASON: Various bugs exist DateTime::diff() -- fall type3 type3 [ext/date/tests/DateTime_diff-fall-type3-type3.phpt] XFAIL REASON: Various bugs exist DateTime::diff() -- spring type2 type3 [ext/date/tests/DateTime_diff-spring-type2-type3.phpt] XFAIL REASON: Various bugs exist DateTime::diff() -- spring type3 type2 [ext/date/tests/DateTime_diff-spring-type3-type2.phpt] XFAIL REASON: Various bugs exist DateTime::diff() -- spring type3 type3 [ext/date/tests/DateTime_diff-spring-type3-type3.phpt] XFAIL REASON: Various bugs exist DateTime::sub() -- fall type2 type3 [ext/date/tests/DateTime_sub-fall-type2-type3.phpt] XFAIL REASON: Various bugs exist DateTime::sub() -- fall type3 type2 [ext/date/tests/DateTime_sub-fall-type3-type2.phpt] XFAIL REASON: Various bugs exist DateTime::sub() -- fall type3 type3 [ext/date/tests/DateTime_sub-fall-type3-type3.phpt] XFAIL REASON: Various bugs exist DateTime::sub() -- spring type2 type3 [ext/date/tests/DateTime_sub-spring-type2-type3.phpt] XFAIL REASON: Various bugs exist DateTime::sub() -- spring type3 type2 [ext/date/tests/DateTime_sub-spring-type3-type2.phpt] XFAIL REASON: Various bugs exist DateTime::sub() -- spring type3 type3 [ext/date/tests/DateTime_sub-spring-type3-type3.phpt] XFAIL REASON: Various bugs exist RFC: DateTime and Daylight Saving Time Transitions (zone type 3) [ext/date/tests/rfc-datetime_and_daylight_saving_time-type3.phpt] XFAIL REASON: RFC not implemented yet Bug #42718 (unsafe_raw filter not applied when configured as default filter) [ext/filter/tests/bug42718.phpt] XFAIL REASON: FILTER_UNSAFE_RAW not applied when configured as default filter, even with flags Bug #45712 (NaN/INF comparison) [ext/standard/tests/math/bug45712.phpt] XFAIL REASON: Bug 45712 not fixed yet. ===================================================================== ===================================================================== FAILED TEST SUMMARY --------------------------------------------------------------------- file_get_contents() test using offset parameter out of range [ext/standard/tests/file/file_get_contents_error001.phpt] Test function getservbyname() by substituting argument 2 with emptyUnsetUndefNull values. [ext/standard/tests/general_functions/getservbyname_variation10.phpt] Test function getservbyname() by substituting argument 2 with boolean values. [ext/standard/tests/general_functions/getservbyname_variation9.phpt] Test function getservbyport() by calling it more than or less than its expected arguments [ext/standard/tests/general_functions/getservbyport_variation1.phpt] http-stream test [ext/standard/tests/network/http-stream.phpt] Test setlocale() function : usage variations - Setting all available locales in the platform [ext/standard/tests/strings/setlocale_variation2.phpt] Bug #32001 (xml_parse*() goes into infinite loop when autodetection in effect), using UTF-* [ext/xml/tests/bug32001.phpt] ===================================================================== ================================================================================ /root/php-5.5.3/ext/standard/tests/file/file_get_contents_error001.phpt ================================================================================ ** ERROR: process timed out ** ================================================================================ 001+ ** ERROR: process timed out ** 001- bool(false) ================================================================================ ================================================================================ /root/php-5.5.3/ext/standard/tests/general_functions/getservbyname_variation10.phpt ================================================================================ *** Test substituting argument 2 with emptyUnsetUndefNull values *** int(80) int(80) int(80) int(80) int(80) int(80) ================================================================================ 002+ int(80) 003+ int(80) 004+ int(80) 005+ int(80) 006+ int(80) 007+ int(80) 002- bool(false) 003- bool(false) 004- bool(false) 005- bool(false) 006- bool(false) 007- bool(false) ================================================================================ ================================================================================ /root/php-5.5.3/ext/standard/tests/general_functions/getservbyname_variation9.phpt ================================================================================ *** Test substituting argument 2 with boolean values *** bool(false) int(80) bool(false) int(80) ================================================================================ 003+ int(80) 004- bool(false) 005+ int(80) 005- bool(false) ================================================================================ ================================================================================ /root/php-5.5.3/ext/standard/tests/general_functions/getservbyport_variation1.phpt ================================================================================ bool(false) string(4) "http" bool(false) Warning: getservbyport() expects parameter 1 to be long, array given in /root/php-5.5.3/ext/standard/tests/general_functions/getservbyport_variation1.php on line 5 NULL Warning: getservbyport() expects parameter 1 to be long, array given in /root/php-5.5.3/ext/standard/tests/general_functions/getservbyport_variation1.php on line 6 NULL Warning: getservbyport() expects parameter 1 to be long, array given in /root/php-5.5.3/ext/standard/tests/general_functions/getservbyport_variation1.php on line 7 NULL string(11) "compressnet" string(4) "http" Warning: getservbyport() expects parameter 1 to be long, object given in /root/php-5.5.3/ext/standard/tests/general_functions/getservbyport_variation1.php on line 10 NULL ================================================================================ 002+ string(4) "http" 003- bool(false) 013+ string(11) "compressnet" 013- bool(false) ================================================================================ ================================================================================ /root/php-5.5.3/ext/standard/tests/network/http-stream.phpt ================================================================================ ** ERROR: process timed out ** ================================================================================ 001+ ** ERROR: process timed out ** 001- ALIVE ================================================================================ ================================================================================ /root/php-5.5.3/ext/standard/tests/strings/setlocale_variation2.phpt ================================================================================ *** Testing setlocale() : usage variations *** -- Test setlocale() with all available locale in the system -- No of locales found on the machine = 454 No of setlocale() success = 452 Expected no of failures = 0 Test FAILED Names of locale() for which setlocale() failed ... array(2) { [0]=> string(14) "hy_AM.armscii8" [1]=> string(19) "ja_JP.shiftjisx0213" } Done ================================================================================ 006+ Test FAILED 007+ Names of locale() for which setlocale() failed ... 008+ array(2) { 009+ [0]=> 010+ string(14) "hy_AM.armscii8" 011+ [1]=> 012+ string(19) "ja_JP.shiftjisx0213" 013+ } 006- Test PASSED ================================================================================ ================================================================================ /root/php-5.5.3/ext/xml/tests/bug32001.phpt ================================================================================ libxml2 Version => 2.7.6 Encoding: UTF-8 XML Prologue: present Chunk size: all data at once BOM: not prepended array(3) { [0]=> string(128) "e38386e382b9e383883ae38386e382b9e3838831: 687474703a2f2f7777772e6578616d706c652e636f6d2fe38386e382b9e383882f, e38386e382b9e38388" [1]=> string(60) "e38386e382b9e383883ae38386e382b9e3838832: e38386e382b9e38388" [2]=> string(42) "e38386e382b9e383883ae38386e382b9e3838833: " } Encoding: UTF-8 XML Prologue: not present Chunk size: all data at once BOM: not prepended array(3) { [0]=> string(128) "e38386e382b9e383883ae38386e382b9e3838831: 687474703a2f2f7777772e6578616d706c652e636f6d2fe38386e382b9e383882f, e38386e382b9e38388" [1]=> string(60) "e38386e382b9e383883ae38386e382b9e3838832: e38386e382b9e38388" [2]=> string(42) "e38386e382b9e383883ae38386e382b9e3838833: " } Encoding: UTF-8 XML Prologue: present Chunk size: all data at once BOM: prepended array(3) { [0]=> string(128) "e38386e382b9e383883ae38386e382b9e3838831: 687474703a2f2f7777772e6578616d706c652e636f6d2fe38386e382b9e383882f, e38386e382b9e38388" [1]=> string(60) "e38386e382b9e383883ae38386e382b9e3838832: e38386e382b9e38388" [2]=> string(42) "e38386e382b9e383883ae38386e382b9e3838833: " } Encoding: UTF-8 XML Prologue: not present Chunk size: all data at once BOM: prepended array(3) { [0]=> string(128) "e38386e382b9e383883ae38386e382b9e3838831: 687474703a2f2f7777772e6578616d706c652e636f6d2fe38386e382b9e383882f, e38386e382b9e38388" [1]=> string(60) "e38386e382b9e383883ae38386e382b9e3838832: e38386e382b9e38388" [2]=> string(42) "e38386e382b9e383883ae38386e382b9e3838833: " } Encoding: UTF-16BE XML Prologue: present Chunk size: all data at once BOM: not prepended array(3) { [0]=> string(128) "e38386e382b9e383883ae38386e382b9e3838831: 687474703a2f2f7777772e6578616d706c652e636f6d2fe38386e382b9e383882f, e38386e382b9e38388" [1]=> string(60) "e38386e382b9e383883ae38386e382b9e3838832: e38386e382b9e38388" [2]=> string(42) "e38386e382b9e383883ae38386e382b9e3838833: " } Encoding: UTF-16BE XML Prologue: present Chunk size: all data at once BOM: prepended array(3) { [0]=> string(128) "e38386e382b9e383883ae38386e382b9e3838831: 687474703a2f2f7777772e6578616d706c652e636f6d2fe38386e382b9e383882f, e38386e382b9e38388" [1]=> string(60) "e38386e382b9e383883ae38386e382b9e3838832: e38386e382b9e38388" [2]=> string(42) "e38386e382b9e383883ae38386e382b9e3838833: " } Encoding: UTF-16BE XML Prologue: not present Chunk size: all data at once BOM: prepended array(3) { [0]=> string(128) "e38386e382b9e383883ae38386e382b9e3838831: 687474703a2f2f7777772e6578616d706c652e636f6d2fe38386e382b9e383882f, e38386e382b9e38388" [1]=> string(60) "e38386e382b9e383883ae38386e382b9e3838832: e38386e382b9e38388" [2]=> string(42) "e38386e382b9e383883ae38386e382b9e3838833: " } Encoding: UTF-16LE XML Prologue: present Chunk size: all data at once BOM: not prepended array(3) { [0]=> string(128) "e38386e382b9e383883ae38386e382b9e3838831: 687474703a2f2f7777772e6578616d706c652e636f6d2fe38386e382b9e383882f, e38386e382b9e38388" [1]=> string(60) "e38386e382b9e383883ae38386e382b9e3838832: e38386e382b9e38388" [2]=> string(42) "e38386e382b9e383883ae38386e382b9e3838833: " } Encoding: UTF-16LE XML Prologue: present Chunk size: all data at once BOM: prepended array(3) { [0]=> string(128) "e38386e382b9e383883ae38386e382b9e3838831: 687474703a2f2f7777772e6578616d706c652e636f6d2fe38386e382b9e383882f, e38386e382b9e38388" [1]=> string(60) "e38386e382b9e383883ae38386e382b9e3838832: e38386e382b9e38388" [2]=> string(42) "e38386e382b9e383883ae38386e382b9e3838833: " } Encoding: UTF-16LE XML Prologue: not present Chunk size: all data at once BOM: prepended array(3) { [0]=> string(128) "e38386e382b9e383883ae38386e382b9e3838831: 687474703a2f2f7777772e6578616d706c652e636f6d2fe38386e382b9e383882f, e38386e382b9e38388" [1]=> string(60) "e38386e382b9e383883ae38386e382b9e3838832: e38386e382b9e38388" [2]=> string(42) "e38386e382b9e383883ae38386e382b9e3838833: " } Encoding: UTF-8 XML Prologue: present Chunk size: 1 byte(s) BOM: not prepended array(3) { [0]=> string(128) "e38386e382b9e383883ae38386e382b9e3838831: 687474703a2f2f7777772e6578616d706c652e636f6d2fe38386e382b9e383882f, e38386e382b9e38388" [1]=> string(60) "e38386e382b9e383883ae38386e382b9e3838832: e38386e382b9e38388" [2]=> string(42) "e38386e382b9e383883ae38386e382b9e3838833: " } Encoding: UTF-8 XML Prologue: not present Chunk size: 1 byte(s) BOM: not prepended array(3) { [0]=> string(128) "e38386e382b9e383883ae38386e382b9e3838831: 687474703a2f2f7777772e6578616d706c652e636f6d2fe38386e382b9e383882f, e38386e382b9e38388" [1]=> string(60) "e38386e382b9e383883ae38386e382b9e3838832: e38386e382b9e38388" [2]=> string(42) "e38386e382b9e383883ae38386e382b9e3838833: " } Encoding: UTF-8 XML Prologue: present Chunk size: 1 byte(s) BOM: prepended array(3) { [0]=> string(128) "e38386e382b9e383883ae38386e382b9e3838831: 687474703a2f2f7777772e6578616d706c652e636f6d2fe38386e382b9e383882f, e38386e382b9e38388" [1]=> string(60) "e38386e382b9e383883ae38386e382b9e3838832: e38386e382b9e38388" [2]=> string(42) "e38386e382b9e383883ae38386e382b9e3838833: " } Encoding: UTF-8 XML Prologue: not present Chunk size: 1 byte(s) BOM: prepended array(3) { [0]=> string(128) "e38386e382b9e383883ae38386e382b9e3838831: 687474703a2f2f7777772e6578616d706c652e636f6d2fe38386e382b9e383882f, e38386e382b9e38388" [1]=> string(60) "e38386e382b9e383883ae38386e382b9e3838832: e38386e382b9e38388" [2]=> string(42) "e38386e382b9e383883ae38386e382b9e3838833: " } Encoding: UTF-16BE XML Prologue: present Chunk size: 1 byte(s) BOM: not prepended [Error] Processing Instruction not started Encoding: UTF-16BE XML Prologue: present Chunk size: 1 byte(s) BOM: prepended [Error] XML_ERR_NAME_REQUIRED Encoding: UTF-16BE XML Prologue: not present Chunk size: 1 byte(s) BOM: prepended [Error] XML_ERR_NAME_REQUIRED Encoding: UTF-16LE XML Prologue: present Chunk size: 1 byte(s) BOM: not prepended [Error] Processing Instruction not finished Encoding: UTF-16LE XML Prologue: present Chunk size: 1 byte(s) BOM: prepended [Error] Processing Instruction not finished Encoding: UTF-16LE XML Prologue: not present Chunk size: 1 byte(s) BOM: prepended [Error] > required ================================================================================ 174+ [Error] Processing Instruction not started 175+ Encoding: UTF-16BE 176+ XML Prologue: present 177+ Chunk size: 1 byte(s) 178+ BOM: prepended 179+ [Error] XML_ERR_NAME_REQUIRED 180+ Encoding: UTF-16BE 181+ XML Prologue: not present 182+ Chunk size: 1 byte(s) 183+ BOM: prepended 184+ [Error] XML_ERR_NAME_REQUIRED 185+ Encoding: UTF-16LE 186+ XML Prologue: present 187+ Chunk size: 1 byte(s) 188+ BOM: not prepended 189+ [Error] Processing Instruction not finished 190+ Encoding: UTF-16LE 174- array(3) { 175- [0]=> 176- string(128) "e38386e382b9e383883ae38386e382b9e3838831: 687474703a2f2f7777772e6578616d706c652e636f6d2fe38386e382b9e383882f, e38386e382b9e38388" 177- [1]=> 178- string(60) "e38386e382b9e383883ae38386e382b9e3838832: e38386e382b9e38388" 179- [2]=> 180- string(42) "e38386e382b9e383883ae38386e382b9e3838833: " 181- } 182- Encoding: UTF-16BE 186- array(3) { 187- [0]=> 188- string(128) "e38386e382b9e383883ae38386e382b9e3838831: 687474703a2f2f7777772e6578616d706c652e636f6d2fe38386e382b9e383882f, e38386e382b9e38388" 189- [1]=> 190- string(60) "e38386e382b9e383883ae38386e382b9e3838832: e38386e382b9e38388" 191- [2]=> 194+ [Error] Processing Instruction not finished 195+ Encoding: UTF-16LE 196+ XML Prologue: not present 197+ Chunk size: 1 byte(s) 198+ BOM: prepended 199+ [Error] > required 192- string(42) "e38386e382b9e383883ae38386e382b9e3838833: " 193- } 194- Encoding: UTF-16BE 195- XML Prologue: not present 196- Chunk size: 1 byte(s) 197- BOM: prepended 198- array(3) { 199- [0]=> 200- string(128) "e38386e382b9e383883ae38386e382b9e3838831: 687474703a2f2f7777772e6578616d706c652e636f6d2fe38386e382b9e383882f, e38386e382b9e38388" 201- [1]=> 202- string(60) "e38386e382b9e383883ae38386e382b9e3838832: e38386e382b9e38388" 203- [2]=> 204- string(42) "e38386e382b9e383883ae38386e382b9e3838833: " 205- } 206- Encoding: UTF-16LE 207- XML Prologue: present 208- Chunk size: 1 byte(s) 209- BOM: not prepended 210- array(3) { 211- [0]=> 212- string(128) "e38386e382b9e383883ae38386e382b9e3838831: 687474703a2f2f7777772e6578616d706c652e636f6d2fe38386e382b9e383882f, e38386e382b9e38388" 213- [1]=> 214- string(60) "e38386e382b9e383883ae38386e382b9e3838832: e38386e382b9e38388" 215- [2]=> 216- string(42) "e38386e382b9e383883ae38386e382b9e3838833: " 217- } 218- Encoding: UTF-16LE 219- XML Prologue: present 220- Chunk size: 1 byte(s) 221- BOM: prepended 222- array(3) { 223- [0]=> 224- string(128) "e38386e382b9e383883ae38386e382b9e3838831: 687474703a2f2f7777772e6578616d706c652e636f6d2fe38386e382b9e383882f, e38386e382b9e38388" 225- [1]=> 226- string(60) "e38386e382b9e383883ae38386e382b9e3838832: e38386e382b9e38388" 227- [2]=> 228- string(42) "e38386e382b9e383883ae38386e382b9e3838833: " 229- } 230- Encoding: UTF-16LE 231- XML Prologue: not present 232- Chunk size: 1 byte(s) 233- BOM: prepended 234- array(3) { 235- [0]=> 236- string(128) "e38386e382b9e383883ae38386e382b9e3838831: 687474703a2f2f7777772e6578616d706c652e636f6d2fe38386e382b9e383882f, e38386e382b9e38388" 237- [1]=> 238- string(60) "e38386e382b9e383883ae38386e382b9e3838832: e38386e382b9e38388" 239- [2]=> 240- string(42) "e38386e382b9e383883ae38386e382b9e3838833: " 241- } ================================================================================ ================================================================================ BUILD ENVIRONMENT ================================================================================ OS: Linux - Linux tecopswebbal800-new 3.0.38-0.5-default #1 SMP Fri Aug 3 09:02:17 UTC 2012 (358029e) x86_64 Autoconf: autoconf (GNU Autoconf) 2.63 Copyright (C) 2008 Free Software Foundation, Inc. License GPLv2+: GNU GPL version 2 or later <http://gnu.org/licenses/old-licenses/gpl-2.0.html> This is free software: you are free to change and redistribute it. There is NO WARRANTY, to the extent permitted by law. Written by David J. MacKenzie and Akim Demaille. Bundled Libtool: ltmain.sh (GNU libtool) 1.5.26 (1.1220.2.492 2008/01/30 06:40:56) Copyright (C) 2008 Free Software Foundation, Inc. This is free software; see the source for copying conditions. There is NO warranty; not even for MERCHANTABILITY or FITNESS FOR A PARTICULAR PURPOSE. System Libtool: ltmain.sh (GNU libtool) 2.2.6 Written by Gordon Matzigkeit <gord@gnu.ai.mit.edu>, 1996 Copyright (C) 2008 Free Software Foundation, Inc. This is free software; see the source for copying conditions. There is NO warranty; not even for MERCHANTABILITY or FITNESS FOR A PARTICULAR PURPOSE. Compiler: Using built-in specs. Target: x86_64-suse-linux Configured with: ../configure --prefix=/usr --infodir=/usr/share/info --mandir=/usr/share/man --libdir=/usr/lib64 --libexecdir=/usr/lib64 --enable-languages=c,c++,objc,fortran,obj-c++,java,ada --enable-checking=release --with-gxx-include-dir=/usr/include/c++/4.3 --enable-ssp --disable-libssp --with-bugurl=http://bugs.opensuse.org/ --with-pkgversion='SUSE Linux' --disable-libgcj --disable-libmudflap --with-slibdir=/lib64 --with-system-zlib --enable-__cxa_atexit --enable-libstdcxx-allocator=new --disable-libstdcxx-pch --enable-version-specific-runtime-libs --program-suffix=-4.3 --enable-linux-futex --without-system-libunwind --with-cpu=generic --build=x86_64-suse-linux Thread model: posix gcc version 4.3.4 [gcc-4_3-branch revision 152973] (SUSE Linux) Bison: bison (GNU Bison) 2.3 Written by Robert Corbett and Richard Stallman. Copyright (C) 2006 Free Software Foundation, Inc. This is free software; see the source for copying conditions. There is NO warranty; not even for MERCHANTABILITY or FITNESS FOR A PARTICULAR PURPOSE. Libraries: linux-vdso.so.1 => (0x00007fff193ff000) libcrypt.so.1 => /lib64/libcrypt.so.1 (0x00002b79f44d3000) libresolv.so.2 => /lib64/libresolv.so.2 (0x00002b79f470e000) librt.so.1 => /lib64/librt.so.1 (0x00002b79f4926000) libm.so.6 => /lib64/libm.so.6 (0x00002b79f4b2f000) libnsl.so.1 => /lib64/libnsl.so.1 (0x00002b79f4da8000) libz.so.1 => /lib64/libz.so.1 (0x00002b79f4fc1000) libxml2.so.2 => /usr/lib64/libxml2.so.2 (0x00002b79f51d7000) libdl.so.2 => /lib64/libdl.so.2 (0x00002b79f5533000) libc.so.6 => /lib64/libc.so.6 (0x00002b79f5738000) libpthread.so.0 => /lib64/libpthread.so.0 (0x00002b79f5aac000) /lib64/ld-linux-x86-64.so.2 (0x00002b79f42b2000) ================================================================================ PHPINFO ================================================================================ phpinfo() PHP Version => 5.5.3 System => Linux tecopswebbal800-new 3.0.38-0.5-default #1 SMP Fri Aug 3 09:02:17 UTC 2012 (358029e) x86_64 Build Date => Sep 9 2013 14:42:13 Configure Command => './configure' Server API => Command Line Interface Virtual Directory Support => disabled Configuration File (php.ini) Path => /usr/local/lib Loaded Configuration File => (none) Scan this dir for additional .ini files => (none) Additional .ini files parsed => (none) PHP API => 20121113 PHP Extension => 20121212 Zend Extension => 220121212 Zend Extension Build => API220121212,NTS PHP Extension Build => API20121212,NTS Debug Build => no Thread Safety => disabled Zend Signal Handling => disabled Zend Memory Manager => enabled Zend Multibyte Support => disabled IPv6 Support => enabled DTrace Support => disabled Registered PHP Streams => php, file, glob, data, http, ftp, phar Registered Stream Socket Transports => tcp, udp, unix, udg Registered Stream Filters => convert.iconv.*, string.rot13, string.toupper, string.tolower, string.strip_tags, convert.*, consumed, dechunk This program makes use of the Zend Scripting Language Engine: Zend Engine v2.5.0, Copyright (c) 1998-2013 Zend Technologies _______________________________________________________________________ Configuration Core PHP Version => 5.5.3 Directive => Local Value => Master Value allow_url_fopen => On => On allow_url_include => Off => Off always_populate_raw_post_data => Off => Off arg_separator.input => & => & arg_separator.output => & => & asp_tags => Off => Off auto_append_file => no value => no value auto_globals_jit => On => On auto_prepend_file => no value => no value browscap => no value => no value default_charset => no value => no value default_mimetype => text/html => text/html disable_classes => no value => no value disable_functions => no value => no value display_errors => STDERR => STDERR display_startup_errors => Off => Off doc_root => no value => no value docref_ext => no value => no value docref_root => no value => no value enable_dl => On => On enable_post_data_reading => On => On error_append_string => no value => no value error_log => no value => no value error_prepend_string => no value => no value error_reporting => no value => no value exit_on_timeout => Off => Off expose_php => On => On extension_dir => /usr/local/lib/php/extensions/no-debug-non-zts-20121212 => /usr/local/lib/php/extensions/no-debug-non-zts-20121212 file_uploads => On => On highlight.comment => <font style="color: #FF8000">#FF8000</font> => <font style="color: #FF8000">#FF8000</font> highlight.default => <font style="color: #0000BB">#0000BB</font> => <font style="color: #0000BB">#0000BB</font> highlight.html => <font style="color: #000000">#000000</font> => <font style="color: #000000">#000000</font> highlight.keyword => <font style="color: #007700">#007700</font> => <font style="color: #007700">#007700</font> highlight.string => <font style="color: #DD0000">#DD0000</font> => <font style="color: #DD0000">#DD0000</font> html_errors => Off => Off ignore_repeated_errors => Off => Off ignore_repeated_source => Off => Off ignore_user_abort => Off => Off implicit_flush => On => On include_path => .:/usr/local/lib/php => .:/usr/local/lib/php log_errors => Off => Off log_errors_max_len => 1024 => 1024 mail.add_x_header => Off => Off mail.force_extra_parameters => no value => no value mail.log => no value => no value max_execution_time => 0 => 0 max_file_uploads => 20 => 20 max_input_nesting_level => 64 => 64 max_input_time => -1 => -1 max_input_vars => 1000 => 1000 memory_limit => 128M => 128M open_basedir => no value => no value output_buffering => 0 => 0 output_handler => no value => no value post_max_size => 8M => 8M precision => 14 => 14 realpath_cache_size => 16K => 16K realpath_cache_ttl => 120 => 120 register_argc_argv => On => On report_memleaks => On => On report_zend_debug => Off => Off request_order => no value => no value sendmail_from => no value => no value sendmail_path => /usr/sbin/sendmail -t -i => /usr/sbin/sendmail -t -i serialize_precision => 17 => 17 short_open_tag => On => On SMTP => localhost => localhost smtp_port => 25 => 25 sql.safe_mode => Off => Off sys_temp_dir => no value => no value track_errors => Off => Off unserialize_callback_func => no value => no value upload_max_filesize => 2M => 2M upload_tmp_dir => no value => no value user_dir => no value => no value user_ini.cache_ttl => 300 => 300 user_ini.filename => .user.ini => .user.ini variables_order => EGPCS => EGPCS xmlrpc_error_number => 0 => 0 xmlrpc_errors => Off => Off zend.detect_unicode => On => On zend.enable_gc => On => On zend.multibyte => Off => Off zend.script_encoding => no value => no value ctype ctype functions => enabled date date/time support => enabled "Olson" Timezone Database Version => 2013.4 Timezone Database => internal Default timezone => UTC Directive => Local Value => Master Value date.default_latitude => 31.7667 => 31.7667 date.default_longitude => 35.2333 => 35.2333 date.sunrise_zenith => 90.583333 => 90.583333 date.sunset_zenith => 90.583333 => 90.583333 date.timezone => no value => no value dom DOM/XML => enabled DOM/XML API Version => 20031129 libxml Version => 2.7.6 HTML Support => enabled XPath Support => enabled XPointer Support => enabled Schema Support => enabled RelaxNG Support => enabled ereg Regex Library => Bundled library enabled fileinfo fileinfo support => enabled version => 1.0.5-dev filter Input Validation and Filtering => enabled Revision => $Id: 12aebcf366f801ceeae618aefd4383fef24e701b $ Directive => Local Value => Master Value filter.default => unsafe_raw => unsafe_raw filter.default_flags => no value => no value hash hash support => enabled Hashing Engines => md2 md4 md5 sha1 sha224 sha256 sha384 sha512 ripemd128 ripemd160 ripemd256 ripemd320 whirlpool tiger128,3 tiger160,3 tiger192,3 tiger128,4 tiger160,4 tiger192,4 snefru snefru256 gost adler32 crc32 crc32b fnv132 fnv164 joaat haval128,3 haval160,3 haval192,3 haval224,3 haval256,3 haval128,4 haval160,4 haval192,4 haval224,4 haval256,4 haval128,5 haval160,5 haval192,5 haval224,5 haval256,5 iconv iconv support => enabled iconv implementation => glibc iconv library version => 2.11.3 Directive => Local Value => Master Value iconv.input_encoding => ISO-8859-1 => ISO-8859-1 iconv.internal_encoding => ISO-8859-1 => ISO-8859-1 iconv.output_encoding => ISO-8859-1 => ISO-8859-1 json json support => enabled json version => 1.2.1 libxml libXML support => active libXML Compiled Version => 2.7.6 libXML Loaded Version => 20706 libXML streams => enabled pcre PCRE (Perl Compatible Regular Expressions) Support => enabled PCRE Library Version => 8.32 2012-11-30 Directive => Local Value => Master Value pcre.backtrack_limit => 1000000 => 1000000 pcre.recursion_limit => 100000 => 100000 PDO PDO support => enabled PDO drivers => sqlite pdo_sqlite PDO Driver for SQLite 3.x => enabled SQLite Library => 3.7.7.1 Phar Phar: PHP Archive support => enabled Phar EXT version => 2.0.1 Phar API version => 1.1.1 SVN revision => $Id: ec8e5fbde7521bb0b03975e5c086f4e10830b36f $ Phar-based phar archives => enabled Tar-based phar archives => enabled ZIP-based phar archives => enabled gzip compression => disabled (install ext/zlib) bzip2 compression => disabled (install pecl/bz2) OpenSSL support => disabled (install ext/openssl) Phar based on pear/PHP_Archive, original concept by Davey Shafik. Phar fully realized by Gregory Beaver and Marcus Boerger. Portions of tar implementation Copyright (c) 2003-2009 Tim Kientzle. Directive => Local Value => Master Value phar.cache_list => no value => no value phar.readonly => On => On phar.require_hash => On => On posix Revision => $Id: 32db6705f5b617967a546be3114e178a4138c1ca $ Reflection Reflection => enabled Version => $Id: b1f7484f243ca1baeb64560b43b1927e7279dc80 $ session Session Support => enabled Registered save handlers => files user Registered serializer handlers => php php_binary Directive => Local Value => Master Value session.auto_start => Off => Off session.cache_expire => 180 => 180 session.cache_limiter => nocache => nocache session.cookie_domain => no value => no value session.cookie_httponly => Off => Off session.cookie_lifetime => 0 => 0 session.cookie_path => / => / session.cookie_secure => Off => Off session.entropy_file => /dev/urandom => /dev/urandom session.entropy_length => 32 => 32 session.gc_divisor => 100 => 100 session.gc_maxlifetime => 1440 => 1440 session.gc_probability => 1 => 1 session.hash_bits_per_character => 4 => 4 session.hash_function => 0 => 0 session.name => PHPSESSID => PHPSESSID session.referer_check => no value => no value session.save_handler => files => files session.save_path => no value => no value session.serialize_handler => php => php session.upload_progress.cleanup => On => On session.upload_progress.enabled => On => On session.upload_progress.freq => 1% => 1% session.upload_progress.min_freq => 1 => 1 session.upload_progress.name => PHP_SESSION_UPLOAD_PROGRESS => PHP_SESSION_UPLOAD_PROGRESS session.upload_progress.prefix => upload_progress_ => upload_progress_ session.use_cookies => On => On session.use_only_cookies => On => On session.use_strict_mode => Off => Off session.use_trans_sid => 0 => 0 SimpleXML Simplexml support => enabled Revision => $Id: eba46b909103648e33046d39de5d9de73bc28162 $ Schema support => enabled SPL SPL support => enabled Interfaces => Countable, OuterIterator, RecursiveIterator, SeekableIterator, SplObserver, SplSubject Classes => AppendIterator, ArrayIterator, ArrayObject, BadFunctionCallException, BadMethodCallException, CachingIterator, CallbackFilterIterator, DirectoryIterator, DomainException, EmptyIterator, FilesystemIterator, FilterIterator, GlobIterator, InfiniteIterator, InvalidArgumentException, IteratorIterator, LengthException, LimitIterator, LogicException, MultipleIterator, NoRewindIterator, OutOfBoundsException, OutOfRangeException, OverflowException, ParentIterator, RangeException, RecursiveArrayIterator, RecursiveCachingIterator, RecursiveCallbackFilterIterator, RecursiveDirectoryIterator, RecursiveFilterIterator, RecursiveIteratorIterator, RecursiveRegexIterator, RecursiveTreeIterator, RegexIterator, RuntimeException, SplDoublyLinkedList, SplFileInfo, SplFileObject, SplFixedArray, SplHeap, SplMinHeap, SplMaxHeap, SplObjectStorage, SplPriorityQueue, SplQueue, SplStack, SplTempFileObject, UnderflowException, UnexpectedValueException sqlite3 SQLite3 support => enabled SQLite3 module version => 0.7-dev SQLite Library => 3.7.7.1 Directive => Local Value => Master Value sqlite3.extension_dir => no value => no value standard Dynamic Library Support => enabled Path to sendmail => /usr/sbin/sendmail -t -i Directive => Local Value => Master Value assert.active => 1 => 1 assert.bail => 0 => 0 assert.callback => no value => no value assert.quiet_eval => 0 => 0 assert.warning => 1 => 1 auto_detect_line_endings => 0 => 0 default_socket_timeout => 60 => 60 from => no value => no value url_rewriter.tags => a=href,area=href,frame=src,form=,fieldset= => a=href,area=href,frame=src,form=,fieldset= user_agent => no value => no value tokenizer Tokenizer Support => enabled xml XML Support => active XML Namespace Support => active libxml2 Version => 2.7.6 xmlreader XMLReader => enabled xmlwriter XMLWriter => enabled Additional Modules Module Name Environment Variable => Value LESSKEY => /etc/lesskey.bin MANPATH => /usr/share/man:/usr/local/man INFODIR => /usr/local/info:/usr/share/info:/usr/info NNTPSERVER => news HOSTNAME => tecopswebbal800-new TEST_PHP_SRCDIR => /root/php-5.5.3 XKEYSYMDB => /usr/share/X11/XKeysymDB SHELL => /bin/bash TERM => xterm HOST => tecopswebbal800-new PROFILEREAD => true MAKEFLAGS => HISTSIZE => 1000 SSH_CLIENT => deleted MORE => -sl QTDIR => /usr/lib/qt3 SSH_TTY => deleted JRE_HOME => /usr/lib64/jvm/jre USER => root LS_COLORS => no=00:fi=00:di=01;34:ln=00;36:pi=40;33:so=01;35:do=01;35:bd=40;33;01:cd=40;33;01:or=41;33;01:ex=00;32:*.cmd=00;32:*.exe=01;32:*.com=01;32:*.bat=01;32:*.btm=01;32:*.dll=01;32:*.tar=00;31:*.tbz=00;31:*.tgz=00;31:*.rpm=00;31:*.deb=00;31:*.arj=00;31:*.taz=00;31:*.lzh=00;31:*.lzma=00;31:*.zip=00;31:*.zoo=00;31:*.z=00;31:*.Z=00;31:*.gz=00;31:*.bz2=00;31:*.tb2=00;31:*.tz2=00;31:*.tbz2=00;31:*.avi=01;35:*.bmp=01;35:*.fli=01;35:*.gif=01;35:*.jpg=01;35:*.jpeg=01;35:*.mng=01;35:*.mov=01;35:*.mpg=01;35:*.pcx=01;35:*.pbm=01;35:*.pgm=01;35:*.png=01;35:*.ppm=01;35:*.tga=01;35:*.tif=01;35:*.xbm=01;35:*.xpm=01;35:*.dl=01;35:*.gl=01;35:*.wmv=01;35:*.aiff=00;32:*.au=00;32:*.mid=00;32:*.mp3=00;32:*.ogg=00;32:*.voc=00;32:*.wav=00;32: XNLSPATH => /usr/share/X11/nls ENV => /etc/bash.bashrc SSH_AUTH_SOCK => deleted HOSTTYPE => x86_64 FROM_HEADER => MAKELEVEL => 1 PAGER => less MFLAGS => CSHEDIT => emacs XDG_CONFIG_DIRS => /etc/xdg MINICOM => -c on PATH => /sbin:/usr/sbin:/usr/local/sbin:/root/bin:/usr/local/bin:/usr/bin:/bin:/usr/bin/X11:/usr/X11R6/bin:/usr/games:/opt/kde3/bin:/usr/lib64/jvm/jre/bin:/usr/lib/mit/bin:/usr/lib/mit/sbin:.:/usr/lib/qt3/bin MAIL => /var/mail/root CPU => x86_64 _ => /root/php-5.5.3/sapi/cli/php JAVA_BINDIR => /usr/lib64/jvm/jre/bin PWD => /root/php-5.5.3 INPUTRC => /etc/inputrc JAVA_HOME => /usr/lib64/jvm/jre LANG => POSIX TEST_PHP_EXECUTABLE => /root/php-5.5.3/sapi/cli/php PYTHONSTARTUP => /etc/pythonstart TZ => US/Eastern HOME => /root SHLVL => 3 QT_SYSTEM_DIR => /usr/share/desktop-data OSTYPE => linux LESS_ADVANCED_PREPROCESSOR => no XCURSOR_THEME => LS_OPTIONS => -A -N --color=tty -T 0 MACHTYPE => x86_64-suse-linux LOGNAME => root LESS => -M -I CVS_RSH => ssh LC_CTYPE => en_US.UTF-8 XDG_DATA_DIRS => /usr/share:/etc/opt/kde3/share:/opt/kde3/share SSH_CONNECTION => deleted LESSOPEN => lessopen.sh %s INFOPATH => /usr/local/info:/usr/share/info:/usr/info CC => cc LESSCLOSE => lessclose.sh %s %s G_BROKEN_FILENAMES => 1 JAVA_ROOT => /usr/lib64/jvm/jre COLORTERM => 1 mc => () { . /usr/share/mc/bin/mc-wrapper.sh } PHP Variables Variable => Value _SERVER["LESSKEY"] => /etc/lesskey.bin _SERVER["MANPATH"] => /usr/share/man:/usr/local/man _SERVER["INFODIR"] => /usr/local/info:/usr/share/info:/usr/info _SERVER["NNTPSERVER"] => news _SERVER["HOSTNAME"] => tecopswebbal800-new _SERVER["TEST_PHP_SRCDIR"] => /root/php-5.5.3 _SERVER["XKEYSYMDB"] => /usr/share/X11/XKeysymDB _SERVER["SHELL"] => /bin/bash _SERVER["TERM"] => xterm _SERVER["HOST"] => tecopswebbal800-new _SERVER["PROFILEREAD"] => true _SERVER["MAKEFLAGS"] => _SERVER["HISTSIZE"] => 1000 _SERVER["SSH_CLIENT"] => deleted _SERVER["MORE"] => -sl _SERVER["QTDIR"] => /usr/lib/qt3 _SERVER["SSH_TTY"] => deleted _SERVER["JRE_HOME"] => /usr/lib64/jvm/jre _SERVER["USER"] => root _SERVER["LS_COLORS"] => no=00:fi=00:di=01;34:ln=00;36:pi=40;33:so=01;35:do=01;35:bd=40;33;01:cd=40;33;01:or=41;33;01:ex=00;32:*.cmd=00;32:*.exe=01;32:*.com=01;32:*.bat=01;32:*.btm=01;32:*.dll=01;32:*.tar=00;31:*.tbz=00;31:*.tgz=00;31:*.rpm=00;31:*.deb=00;31:*.arj=00;31:*.taz=00;31:*.lzh=00;31:*.lzma=00;31:*.zip=00;31:*.zoo=00;31:*.z=00;31:*.Z=00;31:*.gz=00;31:*.bz2=00;31:*.tb2=00;31:*.tz2=00;31:*.tbz2=00;31:*.avi=01;35:*.bmp=01;35:*.fli=01;35:*.gif=01;35:*.jpg=01;35:*.jpeg=01;35:*.mng=01;35:*.mov=01;35:*.mpg=01;35:*.pcx=01;35:*.pbm=01;35:*.pgm=01;35:*.png=01;35:*.ppm=01;35:*.tga=01;35:*.tif=01;35:*.xbm=01;35:*.xpm=01;35:*.dl=01;35:*.gl=01;35:*.wmv=01;35:*.aiff=00;32:*.au=00;32:*.mid=00;32:*.mp3=00;32:*.ogg=00;32:*.voc=00;32:*.wav=00;32: _SERVER["XNLSPATH"] => /usr/share/X11/nls _SERVER["ENV"] => /etc/bash.bashrc _SERVER["SSH_AUTH_SOCK"] => deleted _SERVER["HOSTTYPE"] => x86_64 _SERVER["FROM_HEADER"] => _SERVER["MAKELEVEL"] => 1 _SERVER["PAGER"] => less _SERVER["MFLAGS"] => _SERVER["CSHEDIT"] => emacs _SERVER["XDG_CONFIG_DIRS"] => /etc/xdg _SERVER["MINICOM"] => -c on _SERVER["PATH"] => /sbin:/usr/sbin:/usr/local/sbin:/root/bin:/usr/local/bin:/usr/bin:/bin:/usr/bin/X11:/usr/X11R6/bin:/usr/games:/opt/kde3/bin:/usr/lib64/jvm/jre/bin:/usr/lib/mit/bin:/usr/lib/mit/sbin:.:/usr/lib/qt3/bin _SERVER["MAIL"] => /var/mail/root _SERVER["CPU"] => x86_64 _SERVER["_"] => /root/php-5.5.3/sapi/cli/php _SERVER["JAVA_BINDIR"] => /usr/lib64/jvm/jre/bin _SERVER["PWD"] => /root/php-5.5.3 _SERVER["INPUTRC"] => /etc/inputrc _SERVER["JAVA_HOME"] => /usr/lib64/jvm/jre _SERVER["LANG"] => POSIX _SERVER["TEST_PHP_EXECUTABLE"] => /root/php-5.5.3/sapi/cli/php _SERVER["PYTHONSTARTUP"] => /etc/pythonstart _SERVER["TZ"] => US/Eastern _SERVER["HOME"] => /root _SERVER["SHLVL"] => 3 _SERVER["QT_SYSTEM_DIR"] => /usr/share/desktop-data _SERVER["OSTYPE"] => linux _SERVER["LESS_ADVANCED_PREPROCESSOR"] => no _SERVER["XCURSOR_THEME"] => _SERVER["LS_OPTIONS"] => -A -N --color=tty -T 0 _SERVER["MACHTYPE"] => x86_64-suse-linux _SERVER["LOGNAME"] => root _SERVER["LESS"] => -M -I _SERVER["CVS_RSH"] => ssh _SERVER["LC_CTYPE"] => en_US.UTF-8 _SERVER["XDG_DATA_DIRS"] => /usr/share:/etc/opt/kde3/share:/opt/kde3/share _SERVER["SSH_CONNECTION"] => deleted _SERVER["LESSOPEN"] => lessopen.sh %s _SERVER["INFOPATH"] => /usr/local/info:/usr/share/info:/usr/info _SERVER["CC"] => cc _SERVER["LESSCLOSE"] => lessclose.sh %s %s _SERVER["G_BROKEN_FILENAMES"] => 1 _SERVER["JAVA_ROOT"] => /usr/lib64/jvm/jre _SERVER["COLORTERM"] => 1 _SERVER["mc"] => () { . /usr/share/mc/bin/mc-wrapper.sh } _SERVER["PHP_SELF"] => _SERVER["SCRIPT_NAME"] => _SERVER["SCRIPT_FILENAME"] => _SERVER["PATH_TRANSLATED"] => _SERVER["DOCUMENT_ROOT"] => _SERVER["REQUEST_TIME_FLOAT"] => 1378753989.2203 _SERVER["REQUEST_TIME"] => 1378753989 _SERVER["argv"] => Array ( ) _SERVER["argc"] => 0 _ENV["LESSKEY"] => /etc/lesskey.bin _ENV["MANPATH"] => /usr/share/man:/usr/local/man _ENV["INFODIR"] => /usr/local/info:/usr/share/info:/usr/info _ENV["NNTPSERVER"] => news _ENV["HOSTNAME"] => tecopswebbal800-new _ENV["TEST_PHP_SRCDIR"] => /root/php-5.5.3 _ENV["XKEYSYMDB"] => /usr/share/X11/XKeysymDB _ENV["SHELL"] => /bin/bash _ENV["TERM"] => xterm _ENV["HOST"] => tecopswebbal800-new _ENV["PROFILEREAD"] => true _ENV["MAKEFLAGS"] => _ENV["HISTSIZE"] => 1000 _ENV["SSH_CLIENT"] => deleted _ENV["MORE"] => -sl _ENV["QTDIR"] => /usr/lib/qt3 _ENV["SSH_TTY"] => deleted _ENV["JRE_HOME"] => /usr/lib64/jvm/jre _ENV["USER"] => root _ENV["LS_COLORS"] => no=00:fi=00:di=01;34:ln=00;36:pi=40;33:so=01;35:do=01;35:bd=40;33;01:cd=40;33;01:or=41;33;01:ex=00;32:*.cmd=00;32:*.exe=01;32:*.com=01;32:*.bat=01;32:*.btm=01;32:*.dll=01;32:*.tar=00;31:*.tbz=00;31:*.tgz=00;31:*.rpm=00;31:*.deb=00;31:*.arj=00;31:*.taz=00;31:*.lzh=00;31:*.lzma=00;31:*.zip=00;31:*.zoo=00;31:*.z=00;31:*.Z=00;31:*.gz=00;31:*.bz2=00;31:*.tb2=00;31:*.tz2=00;31:*.tbz2=00;31:*.avi=01;35:*.bmp=01;35:*.fli=01;35:*.gif=01;35:*.jpg=01;35:*.jpeg=01;35:*.mng=01;35:*.mov=01;35:*.mpg=01;35:*.pcx=01;35:*.pbm=01;35:*.pgm=01;35:*.png=01;35:*.ppm=01;35:*.tga=01;35:*.tif=01;35:*.xbm=01;35:*.xpm=01;35:*.dl=01;35:*.gl=01;35:*.wmv=01;35:*.aiff=00;32:*.au=00;32:*.mid=00;32:*.mp3=00;32:*.ogg=00;32:*.voc=00;32:*.wav=00;32: _ENV["XNLSPATH"] => /usr/share/X11/nls _ENV["ENV"] => /etc/bash.bashrc _ENV["SSH_AUTH_SOCK"] => deleted _ENV["HOSTTYPE"] => x86_64 _ENV["FROM_HEADER"] => _ENV["MAKELEVEL"] => 1 _ENV["PAGER"] => less _ENV["MFLAGS"] => _ENV["CSHEDIT"] => emacs _ENV["XDG_CONFIG_DIRS"] => /etc/xdg _ENV["MINICOM"] => -c on _ENV["PATH"] => /sbin:/usr/sbin:/usr/local/sbin:/root/bin:/usr/local/bin:/usr/bin:/bin:/usr/bin/X11:/usr/X11R6/bin:/usr/games:/opt/kde3/bin:/usr/lib64/jvm/jre/bin:/usr/lib/mit/bin:/usr/lib/mit/sbin:.:/usr/lib/qt3/bin _ENV["MAIL"] => /var/mail/root _ENV["CPU"] => x86_64 _ENV["_"] => /root/php-5.5.3/sapi/cli/php _ENV["JAVA_BINDIR"] => /usr/lib64/jvm/jre/bin _ENV["PWD"] => /root/php-5.5.3 _ENV["INPUTRC"] => /etc/inputrc _ENV["JAVA_HOME"] => /usr/lib64/jvm/jre _ENV["LANG"] => POSIX _ENV["TEST_PHP_EXECUTABLE"] => /root/php-5.5.3/sapi/cli/php _ENV["PYTHONSTARTUP"] => /etc/pythonstart _ENV["TZ"] => US/Eastern _ENV["HOME"] => /root _ENV["SHLVL"] => 3 _ENV["QT_SYSTEM_DIR"] => /usr/share/desktop-data _ENV["OSTYPE"] => linux _ENV["LESS_ADVANCED_PREPROCESSOR"] => no _ENV["XCURSOR_THEME"] => _ENV["LS_OPTIONS"] => -A -N --color=tty -T 0 _ENV["MACHTYPE"] => x86_64-suse-linux _ENV["LOGNAME"] => root _ENV["LESS"] => -M -I _ENV["CVS_RSH"] => ssh _ENV["LC_CTYPE"] => en_US.UTF-8 _ENV["XDG_DATA_DIRS"] => /usr/share:/etc/opt/kde3/share:/opt/kde3/share _ENV["SSH_CONNECTION"] => deleted _ENV["LESSOPEN"] => lessopen.sh %s _ENV["INFOPATH"] => /usr/local/info:/usr/share/info:/usr/info _ENV["CC"] => cc _ENV["LESSCLOSE"] => lessclose.sh %s %s _ENV["G_BROKEN_FILENAMES"] => 1 _ENV["JAVA_ROOT"] => /usr/lib64/jvm/jre _ENV["COLORTERM"] => 1 _ENV["mc"] => () { . /usr/share/mc/bin/mc-wrapper.sh } PHP License This program is free software; you can redistribute it and/or modify it under the terms of the PHP License as published by the PHP Group and included in the distribution in the file: LICENSE This program is distributed in the hope that it will be useful, but WITHOUT ANY WARRANTY; without even the implied warranty of MERCHANTABILITY or FITNESS FOR A PARTICULAR PURPOSE. If you did not receive a copy of the PHP license, or have any questions about PHP licensing, please contact license@php.net.
« previous php.qa.reports (#31313) next »