Test results for 5.0.0RC2 [failed]

From: Date: Wed, 26 May 2004 06:19:07 +0000
Subject: Test results for 5.0.0RC2 [failed]
Groups: php.qa 
Request: Send a blank email to php-qa+get-17651@lists.php.net to get a copy of this message
===================================================================== FAILED TEST SUMMARY --------------------------------------------------------------------- Test for buffering in core functions with implicit flush off [tests/func/008.phpt] Bug #22367 (weird zval allocation problem) [tests/lang/bug22367.phpt] Bug #22836 (returning references to NULL) [Zend/tests/bug22836.phpt] Bug #27582 (Filling to border an area using tiles). [ext/gd/tests/bug27582_2.phpt] iconv stream filter [ext/iconv/tests/iconv_stream_filter.phpt] HTML input/output [ext/mbstring/tests/htmlent.phpt] mb_output_handler() (Shift_JIS) [ext/mbstring/tests/mb_output_handler_shift_jis.phpt] Bug #22414 (passthru() does not read data correctly) [ext/standard/tests/file/bug22414.phpt] Bug #20382 (strtotime ("Monday", $date) produces wrong result on DST changeover) [ext/standard/tests/time/bug20382.phpt] wddx deserialization test [ext/wddx/tests/001.phpt] Bug #26614 (CDATA sections skipped on line count) [ext/xml/tests/bug26614.phpt] ===================================================================== ===================================================================== TEST RESULT SUMMARY --------------------------------------------------------------------- Exts skipped : 48 Exts tested : 35 --------------------------------------------------------------------- Number of tests : 1184 682 Tests skipped : 502 ( 42.4%) -------- Tests warned : 0 ( 0.0%) ( 0.0%) Tests failed : 11 ( 0.9%) ( 1.6%) Tests passed : 671 ( 56.7%) ( 98.4%) --------------------------------------------------------------------- Time taken : 311 seconds ===================================================================== ===================================================================== FAILED TEST SUMMARY --------------------------------------------------------------------- Test for buffering in core functions with implicit flush off [tests/func/008.phpt] Bug #22367 (weird zval allocation problem) [tests/lang/bug22367.phpt] Bug #22836 (returning references to NULL) [Zend/tests/bug22836.phpt] Bug #27582 (Filling to border an area using tiles). [ext/gd/tests/bug27582_2.phpt] iconv stream filter [ext/iconv/tests/iconv_stream_filter.phpt] HTML input/output [ext/mbstring/tests/htmlent.phpt] mb_output_handler() (Shift_JIS) [ext/mbstring/tests/mb_output_handler_shift_jis.phpt] Bug #22414 (passthru() does not read data correctly) [ext/standard/tests/file/bug22414.phpt] Bug #20382 (strtotime ("Monday", $date) produces wrong result on DST changeover) [ext/standard/tests/time/bug20382.phpt] wddx deserialization test [ext/wddx/tests/001.phpt] Bug #26614 (CDATA sections skipped on line count) [ext/xml/tests/bug26614.phpt] ===================================================================== ================================================================================ /usr/src/server/php-5.0.0RC2/tests/func/008.phpt ================================================================================ ---- EXPECTED OUTPUT 'foo1' 'foo2' ---- ACTUAL OUTPUT ---- FAILED ================================================================================ 001- 'foo1' 003- 'foo2' ================================================================================ ================================================================================ /usr/src/server/php-5.0.0RC2/tests/lang/bug22367.phpt ================================================================================ ---- EXPECTED OUTPUT Strict Standards: Declaration of bar::a() must be compatible with that of foo::a() in %sbug22367.php on line %d Strict Standards: Implicit cloning object of class 'bar' because of 'zend.ze1_compatibility_mode' in %sbug22367.php on line %d int(5) bool(false) Notice: Undefined offset: 5 in %sbug22367.php on line %d Strict Standards: Only variable references should be returned by reference in %sbug22367.php on line %d bool(false) array(5) { [0]=> int(0) [1]=> int(1) [2]=> int(2) [3]=> int(3) [4]=> int(4) } array(5) { [0]=> int(0) [1]=> int(1) [2]=> int(2) [3]=> int(3) [4]=> int(4) } Strict Standards: Implicit cloning object of class 'bar' because of 'zend.ze1_compatibility_mode' in %sbug22367.php on line %d int(2) bool(true) bool(true) array(5) { [0]=> int(0) [1]=> int(1) [2]=> int(2) [3]=> int(3) [4]=> int(4) } array(5) { [0]=> int(0) [1]=> int(1) [2]=> int(2) [3]=> int(3) [4]=> int(4) } ---- ACTUAL OUTPUT Strict Standards: Declaration of bar::a() should be compatible with that of foo::a() in /usr/src/server/php-5.0.0RC2/tests/lang/bug22367.php on line 45 Strict Standards: Implicit cloning object of class 'bar' because of 'zend.ze1_compatibility_mode' in /usr/src/server/php-5.0.0RC2/tests/lang/bug22367.php on line 47 int(5) bool(false) Notice: Undefined offset: 5 in /usr/src/server/php-5.0.0RC2/tests/lang/bug22367.php on line 9 Strict Standards: Only variable references should be returned by reference in /usr/src/server/php-5.0.0RC2/tests/lang/bug22367.php on line 40 bool(false) array(5) { [0]=> int(0) [1]=> int(1) [2]=> int(2) [3]=> int(3) [4]=> int(4) } array(5) { [0]=> int(0) [1]=> int(1) [2]=> int(2) [3]=> int(3) [4]=> int(4) } Strict Standards: Implicit cloning object of class 'bar' because of 'zend.ze1_compatibility_mode' in /usr/src/server/php-5.0.0RC2/tests/lang/bug22367.php on line 54 int(2) bool(true) bool(true) array(5) { [0]=> int(0) [1]=> int(1) [2]=> int(2) [3]=> int(3) [4]=> int(4) } array(5) { [0]=> int(0) [1]=> int(1) [2]=> int(2) [3]=> int(3) [4]=> int(4) } ---- FAILED ================================================================================ 001+ Strict Standards: Declaration of bar::a() should be compatible with that of foo::a() in /usr/src/server/php-5.0.0RC2/tests/lang/bug22367.php on line 45 001- Strict Standards: Declaration of bar::a() must be compatible with that of foo::a() in %sbug22367.php on line %d ================================================================================ ================================================================================ /usr/src/server/php-5.0.0RC2/Zend/tests/bug22836.phpt ================================================================================ ---- EXPECTED OUTPUT string(3) "foo" 'foo' Notice: Undefined variable: a in %s on line %d Strict Standards: Only variable references should be returned by reference in %s on line %d string(3) "foo" 'foo' Notice: Undefined variable: a in %s on line %d Strict Standards: Only variable references should be returned by reference in %s on line %d string(3) "foo" 'foo' Notice: Undefined variable: a in %s on line %d Strict Standards: Only variable references should be returned by reference in %s on line %d string(3) "foo" 'foo' Notice: Undefined variable: a in %s on line %d Strict Standards: Only variable references should be returned by reference in %s on line %d string(3) "foo" 'foo' Notice: Undefined variable: a in %s on line %d Strict Standards: Only variable references should be returned by reference in %s on line %d string(3) "foo" 'foo' Notice: Undefined variable: a in %s on line %d Strict Standards: Only variable references should be returned by reference in %s on line %d string(3) "foo" 'foo' Notice: Undefined variable: a in %s on line %d Strict Standards: Only variable references should be returned by reference in %s on line %d string(3) "foo" 'foo' Notice: Undefined variable: a in %s on line %d Strict Standards: Only variable references should be returned by reference in %s on line %d string(3) "foo" 'foo' Notice: Undefined variable: a in %s on line %d Strict Standards: Only variable references should be returned by reference in %s on line %d ---- ACTUAL OUTPUT string(3) "foo" 'foo' Notice: Undefined variable: a in /usr/src/server/php-5.0.0RC2/Zend/tests/bug22836.php on line 7 Strict Standards: Only variable references should be returned by reference in /usr/src/server/php-5.0.0RC2/Zend/tests/bug22836.php on line 7 string(3) "foo" 'foo' Notice: Undefined variable: a in /usr/src/server/php-5.0.0RC2/Zend/tests/bug22836.php on line 7 Strict Standards: Only variable references should be returned by reference in /usr/src/server/php-5.0.0RC2/Zend/tests/bug22836.php on line 7 NULL 'foo' Notice: Undefined variable: a in /usr/src/server/php-5.0.0RC2/Zend/tests/bug22836.php on line 7 NULL 'foo' Notice: Undefined variable: a in /usr/src/server/php-5.0.0RC2/Zend/tests/bug22836.php on line 7 NULL 'foo' Notice: Undefined variable: a in /usr/src/server/php-5.0.0RC2/Zend/tests/bug22836.php on line 7 NULL 'foo' Notice: Undefined variable: a in /usr/src/server/php-5.0.0RC2/Zend/tests/bug22836.php on line 7 NULL 'foo' Notice: Undefined variable: a in /usr/src/server/php-5.0.0RC2/Zend/tests/bug22836.php on line 7 NULL 'foo' Notice: Undefined variable: a in /usr/src/server/php-5.0.0RC2/Zend/tests/bug22836.php on line 7 ---- FAILED ================================================================================ 013+ NULL 013- string(3) "foo" 017+ NULL 018+ 'foo' 018- Strict Standards: Only variable references should be returned by reference in %s on line %d 019- string(3) "foo" 020+ Notice: Undefined variable: a in /usr/src/server/php-5.0.0RC2/Zend/tests/bug22836.php on line 7 021+ NULL 022+ 'foo' 023+ 024+ Notice: Undefined variable: a in /usr/src/server/php-5.0.0RC2/Zend/tests/bug22836.php on line 7 025+ NULL 026+ 'foo' 027+ 028+ Notice: Undefined variable: a in /usr/src/server/php-5.0.0RC2/Zend/tests/bug22836.php on line 7 029+ NULL 030+ 'foo' 031+ 032+ Notice: Undefined variable: a in /usr/src/server/php-5.0.0RC2/Zend/tests/bug22836.php on line 7 033+ NULL 023- 024- Strict Standards: Only variable references should be returned by reference in %s on line %d 025- string(3) "foo" 026- 'foo' 027- 028- Notice: Undefined variable: a in %s on line %d 029- 030- Strict Standards: Only variable references should be returned by reference in %s on line %d 031- string(3) "foo" 032- 'foo' 033- 034- Notice: Undefined variable: a in %s on line %d 035- 036- Strict Standards: Only variable references should be returned by reference in %s on line %d 037- string(3) "foo" 038- 'foo' 039- 040- Notice: Undefined variable: a in %s on line %d 041- 042- Strict Standards: Only variable references should be returned by reference in %s on line %d 043- string(3) "foo" 044- 'foo' 045- 046- Notice: Undefined variable: a in %s on line %d 047- 048- Strict Standards: Only variable references should be returned by reference in %s on line %d 049- string(3) "foo" 050- 'foo' 051- 052- Notice: Undefined variable: a in %s on line %d 053- 054- Strict Standards: Only variable references should be returned by reference in %s on line %d ================================================================================ ================================================================================ /usr/src/server/php-5.0.0RC2/ext/gd/tests/bug27582_2.phpt ================================================================================ ---- EXPECTED OUTPUT 000000111111101010 111111111111111111 ---- ACTUAL OUTPUT 000000111111101010 ---- FAILED ================================================================================ 002- 111111111111111111 ================================================================================ ================================================================================ /usr/src/server/php-5.0.0RC2/ext/iconv/tests/iconv_stream_filter.phpt ================================================================================ ---- EXPECTED OUTPUT string(20) "1b244224332473244b24" string(10) "41244f1b28" string(2) "42" string(20) "a4b3a4f3a4cba4c1a4cf" string(10) "69636f6e76" string(2) "0a" Warning: fread(): iconv stream filter ("ISO-2022-JP"=>"EUC-JP"): invalid multibyte sequence in %s on line %d string(0) "" string(0) "" string(0) "" ---- ACTUAL OUTPUT string(20) "1b244224332473244b24" string(10) "41244f1b28" string(2) "42" string(20) "a4b3a4f3a4cba4c1a4cf" string(10) "69636f6e76" string(2) "0a" string(20) "1b244f24332466245824" string(10) "4e24421b28" string(2) "4f" ---- FAILED ================================================================================ 007+ string(20) "1b244f24332466245824" 008+ string(10) "4e24421b28" 009+ string(2) "4f" 007- 008- Warning: fread(): iconv stream filter ("ISO-2022-JP"=>"EUC-JP"): invalid multibyte sequence in %s on line %d 009- string(0) "" 010- string(0) "" 011- string(0) "" ================================================================================ ================================================================================ /usr/src/server/php-5.0.0RC2/ext/mbstring/tests/htmlent.phpt ================================================================================ ---- EXPECTED OUTPUT HTML-ENTITIES>UTF-8>HTML-ENTITIES test='&&;&@AB&#128;&#129;&#130;&auml;&ouml;&uuml;&euro;&lang;&rang;' ---- ACTUAL OUTPUT ---- FAILED ================================================================================ 001+ 001- HTML-ENTITIES>UTF-8>HTML-ENTITIES 002- test='&&;&@AB&#128;&#129;&#130;&auml;&ouml;&uuml;&euro;&lang;&rang;' ================================================================================ ================================================================================ /usr/src/server/php-5.0.0RC2/ext/mbstring/tests/mb_output_handler_shift_jis.phpt ================================================================================ ---- EXPECTED OUTPUT string(73) "¥Æ¥¹¥ÈÍÑÆüËܸìʸ»úÎ󡣤³¤Î¥â¥¸¥å¡¼¥ë¤ÏPHP¤Ë¥Þ¥ë¥Á¥Ð¥¤¥È´Ø¿ô¤òÄ󶡤·¤Þ¤¹¡£" ---- ACTUAL OUTPUT ---- FAILED ================================================================================ 001+ 001- string(73) "¥Æ¥¹¥ÈÍÑÆüËܸìʸ»úÎ󡣤³¤Î¥â¥¸¥å¡¼¥ë¤ÏPHP¤Ë¥Þ¥ë¥Á¥Ð¥¤¥È´Ø¿ô¤òÄ󶡤·¤Þ¤¹¡£" ================================================================================ ================================================================================ /usr/src/server/php-5.0.0RC2/ext/standard/tests/file/bug22414.phpt ================================================================================ ---- EXPECTED OUTPUT HELLO Works ---- ACTUAL OUTPUT HELLO sh: line 1: /usr/lib/php/bin/php: Datei oder Verzeichnis nicht gefunden Does not work ---- FAILED ================================================================================ 002+ sh: line 1: /usr/lib/php/bin/php: Datei oder Verzeichnis nicht gefunden 002- Works 003+ Does not work ================================================================================ ================================================================================ /usr/src/server/php-5.0.0RC2/ext/standard/tests/time/bug20382.phpt ================================================================================ ---- EXPECTED OUTPUT tStamp=Wednesday 2004-10-27 17:17:17 CEST result=Monday 2004-11-01 00:00:00 CET wanted=Monday 2004-11-01 00:00:00 CET ---- ACTUAL OUTPUT tStamp=Wednesday 2004-10-27 17:17:17 CEST result=Sunday 2004-10-31 23:00:00 CET wanted=Monday 2004-11-01 00:00:00 CET ---- FAILED ================================================================================ 002+ result=Sunday 2004-10-31 23:00:00 CET 002- result=Monday 2004-11-01 00:00:00 CET ================================================================================ ================================================================================ /usr/src/server/php-5.0.0RC2/ext/wddx/tests/001.phpt ================================================================================ ---- EXPECTED OUTPUT array(11) { ["aNull"]=> NULL ["aString"]=> string(8) "a string" ["aNumber"]=> float(-12.456) ["aDateTime"]=> int(897625932) ["aDateTime2"]=> int(329632332) ["aDateTime3"]=> string(22) "2040-06-12T04:32:12+00" ["aBoolean"]=> bool(true) ["anArray"]=> array(2) { [0]=> int(10) [1]=> string(14) "second element" } ["aBinary"]=> string(11) "binary data" ["anObject"]=> array(2) { ["s"]=> string(8) "a string" ["n"]=> float(-12.456) } ["aRecordset"]=> array(2) { ["NAME"]=> array(2) { [0]=> string(8) "John Doe" [1]=> string(8) "Jane Doe" } ["AGE"]=> array(2) { [0]=> int(34) [1]=> int(31) } } } ---- ACTUAL OUTPUT array(11) { ["aNull"]=> NULL ["aString"]=> string(8) "a string" ["aNumber"]=> float(-12.456) ["aDateTime"]=> int(897625932) ["aDateTime2"]=> int(329632332) ["aDateTime3"]=> string(19) "2040-06-12T04:32:12" ["aBoolean"]=> bool(true) ["anArray"]=> array(2) { [0]=> int(10) [1]=> string(14) "second element" } ["aBinary"]=> string(11) "binary data" ["anObject"]=> array(2) { ["s"]=> string(8) "a string" ["n"]=> float(-12.456) } ["aRecordset"]=> array(2) { ["NAME"]=> array(2) { [0]=> string(8) "John Doe" [1]=> string(8) "Jane Doe" } ["AGE"]=> array(2) { [0]=> int(34) [1]=> int(31) } } } ---- FAILED ================================================================================ 013+ string(19) "2040-06-12T04:32:12" 013- string(22) "2040-06-12T04:32:12+00" ================================================================================ ================================================================================ /usr/src/server/php-5.0.0RC2/ext/xml/tests/bug26614.phpt ================================================================================ ---- EXPECTED OUTPUT CDATA <DATA> at line 2, col 0 (byte 45) </DATA> at line 9, col 0 (byte 90) Comment <DATA> at line 2, col 0 (byte 45) </DATA> at line 9, col 0 (byte 90) Text <DATA> at line 2, col 0 (byte 45) </DATA> at line 9, col 0 (byte 90) ---- ACTUAL OUTPUT CDATA <DATA> at line 2, col 6 (byte 9) </DATA> at line 4, col 47 (byte 56) Comment <DATA> at line 2, col 6 (byte 9) </DATA> at line 9, col 7 (byte 56) Text <DATA> at line 2, col 6 (byte 9) </DATA> at line 9, col 10 (byte 56) ---- FAILED ================================================================================ 002+ <DATA> at line 2, col 6 (byte 9) 003+ </DATA> at line 4, col 47 (byte 56) 002- <DATA> at line 2, col 0 (byte 45) 003- </DATA> at line 9, col 0 (byte 90) 005+ <DATA> at line 2, col 6 (byte 9) 006+ </DATA> at line 9, col 7 (byte 56) 005- <DATA> at line 2, col 0 (byte 45) 006- </DATA> at line 9, col 0 (byte 90) 008+ <DATA> at line 2, col 6 (byte 9) 009+ </DATA> at line 9, col 10 (byte 56) 008- <DATA> at line 2, col 0 (byte 45) 009- </DATA> at line 9, col 0 (byte 90) ================================================================================ ================================================================================ BUILD ENVIRONMENT ================================================================================ OS: Linux - Linux kafka 2.4.21-215-default #1 Tue Apr 27 01:00:43 UTC 2004 i686 Automake: automake (GNU automake) 1.7.6 Written by Tom Tromey <tromey@redhat.com>. Copyright 2003 Free Software Foundation, Inc. This is free software; see the source for copying conditions. There is NO warranty; not even for MERCHANTABILITY or FITNESS FOR A PARTICULAR PURPOSE. Autoconf: Bundled Libtool: ltmain.sh (GNU libtool) 1.4.3 (1.922.2.110 2002/10/23 01:39:54) System Libtool: ltmain.sh (GNU libtool) 1.5 (1.1220.2.1 2003/04/14 22:48:00) Copyright (C) 2003 Free Software Foundation, Inc. This is free software; see the source for copying conditions. There is NO warranty; not even for MERCHANTABILITY or FITNESS FOR A PARTICULAR PURPOSE. Compiler: Reading specs from /usr/lib/gcc-lib/i586-suse-linux/3.3.1/specs Konfiguriert mit: ../configure --enable-threads=posix --prefix=/usr --with-local-prefix=/usr/local --infodir=/usr/share/info --mandir=/usr/share/man --libdir=/usr/lib --enable-languages=c,c++,f77,objc,java,ada --disable-checking --enable-libgcj --with-gxx-include-dir=/usr/include/g++ --with-slibdir=/lib --with-system-zlib --enable-shared --enable-__cxa_atexit i586-suse-linux Thread model: posix gcc-Version 3.3.1 (SuSE Linux) Bison: bison (GNU Bison) 1.75 Geschrieben von Robert Corbett und Richard Stallman. Copyright © 2002 Free Software Foundation, Inc. Dies ist freie Software; die Kopierbedingungen stehen in den Quellen. Es gibt keine Garantie; auch nicht für VERKAUFBARKEIT oder FÜR SPEZIELLE ZWECKE. Libraries: libcrypt.so.1 => /lib/libcrypt.so.1 (0x40021000) libmysqlclient.so.12 => /usr/lib/libmysqlclient.so.12 (0x40053000) libmhash.so.2 => /usr/lib/libmhash.so.2 (0x40089000) libmcrypt.so.4 => /usr/lib/libmcrypt.so.4 (0x400aa000) libltdl.so.3 => /usr/lib/libltdl.so.3 (0x400e3000) libdl.so.2 => /lib/libdl.so.2 (0x400ea000) libgmp.so.3 => /usr/lib/libgmp.so.3 (0x400ed000) libfreetype.so.6 => /usr/lib/libfreetype.so.6 (0x4011c000) libpng.so.3 => /usr/lib/libpng.so.3 (0x40172000) libz.so.1 => /lib/libz.so.1 (0x401a0000) libjpeg.so.62 => /usr/lib/libjpeg.so.62 (0x401b0000) libgdbm.so.3 => /usr/lib/libgdbm.so.3 (0x401d0000) libgdbm_compat.so.3 => /usr/lib/libgdbm_compat.so.3 (0x401d6000) libssl.so.0.9.7 => /usr/lib/libssl.so.0.9.7 (0x401d9000) libcrypto.so.0.9.7 => /usr/lib/libcrypto.so.0.9.7 (0x40209000) libbz2.so.1 => /usr/lib/libbz2.so.1 (0x402fb000) libresolv.so.2 => /lib/libresolv.so.2 (0x4030c000) libm.so.6 => /lib/i686/libm.so.6 (0x4031e000) libnsl.so.1 => /lib/libnsl.so.1 (0x40341000) libcurl.so.2 => /usr/lib/libcurl.so.2 (0x40356000) libxml2.so.2 => /usr/lib/libxml2.so.2 (0x4037d000) libpthread.so.0 => /lib/i686/libpthread.so.0 (0x4047d000) libc.so.6 => /lib/i686/libc.so.6 (0x404cf000) libnss_files.so.2 => /lib/libnss_files.so.2 (0x40602000) libnss_dns.so.2 => /lib/libnss_dns.so.2 (0x4060c000) /lib/ld-linux.so.2 => /lib/ld-linux.so.2 (0x40000000) User's E-mail: ================================================================================ PHPINFO ================================================================================ phpinfo() PHP Version => 5.0.0RC2 System => Linux kafka 2.4.21-215-default #1 Tue Apr 27 01:00:43 UTC 2004 i686 Build Date => May 26 2004 07:23:17 Configure Command => './configure' '--prefix=/usr/share' '--datadir=/usr/share/php' '--with-apxs2=/usr/local/apache2/bin/apxs' '--with-mysql' '--bindir=/usr/bin' '--libdir=/usr/share' '--includedir=/usr/include' '--sysconfdir=/etc' '--with-_lib=lib' '--with-config-file-path=/etc' '--with-exec-dir=/usr/lib/php/bin' '--disable-debug' '--enable-so' '--enable-bcmath' '--enable-calendar' '--enable-ctype' '--enable-dbase' '--enable-discard-path' '--enable-exif' '--enable-filepro' '--enable-force-cgi-redirect' '--enable-ftp' '--enable-gd-imgstrttf' '--enable-gd-native-ttf' '--enable-inline-optimization' '--enable-magic-quotes' '--enable-mbstr-enc-trans' '--enable-mbstring' '--enable-mbregex' '--enable-memory-limit' '--enable-safe-mode' '--enable-shmop' '--enable-sigchild' '--enable-sysvsem' '--enable-sysvshm' '--enable-track-vars' '--enable-trans-sid' '--enable-versioning' '--enable-wddx' '--with-bz2' '--with-dom=/usr/include/libxml2' '--with-ftp' '--with-gdbm' '--with-gettext' '-! -with-gmp' '--with-jpeg-dir=/usr' '--with-mcal=/usr' '--with-mcrypt' '--with-mysql=/usr' '--with-ndbm' '--with-png-dir=/usr' '--with-xml' '--with-zlib=yes' '--with-gd' '--with-openssl' '--with-curl' '--with-imap-ssl' '--with-iconv' 'i586-suse-linux' '--with-mhash' '--with-pear=/home/php/pear' '--with-tiff-dir=/usr' '--with-ttf' '--with-zlib' '--with-dom' '--with-dom-xslt' '--enable-xslt' '--with-xslt-sablot=/usr/local' '--with-freetype-dir=yes' Server API => Command Line Interface Virtual Directory Support => disabled Configuration File (php.ini) Path => /etc PHP API => 20031224 PHP Extension => 20040412 Zend Extension => 220040412 Debug Build => no Thread Safety => disabled IPv6 Support => enabled Registered PHP Streams => php, file, http, ftp, compress.bzip2, compress.zlib, https, ftps Registered Stream Socket Transports => tcp, udp, unix, udg, ssl, tls This program makes use of the Zend Scripting Language Engine: Zend Engine v2.0.0RC2, Copyright (c) 1998-2004 Zend Technologies _______________________________________________________________________ Configuration PHP Core Directive => Local Value => Master Value allow_call_time_pass_reference => On => On allow_url_fopen => On => On always_populate_raw_post_data => Off => Off arg_separator.input => & => & arg_separator.output => & => & asp_tags => Off => Off auto_append_file => no value => no value auto_globals_jit => On => On auto_prepend_file => no value => no value browscap => no value => no value default_charset => no value => no value default_mimetype => text/html => text/html define_syslog_variables => Off => Off disable_classes => no value => no value disable_functions => no value => no value display_errors => On => On display_startup_errors => Off => Off doc_root => no value => no value docref_ext => no value => no value docref_root => no value => no value enable_dl => On => On error_append_string => no value => no value error_log => no value => no value error_prepend_string => no value => no value error_reporting => no value => no value expose_php => On => On extension_dir => /usr/share/extensions/no-debug-non-zts-20040412 => /usr/share/extensions/no-debug-non-zts-20040412 file_uploads => On => On highlight.bg => #FFFFFF => #FFFFFF highlight.comment => #FF8000 => #FF8000 highlight.default => #0000BB => #0000BB highlight.html => #000000 => #000000 highlight.keyword => #007700 => #007700 highlight.string => #DD0000 => #DD0000 html_errors => Off => On ignore_repeated_errors => Off => Off ignore_repeated_source => Off => Off ignore_user_abort => Off => Off implicit_flush => On => Off include_path => .:/home/php/pear => .:/home/php/pear log_errors => Off => Off log_errors_max_len => 1024 => 1024 magic_quotes_gpc => On => On magic_quotes_runtime => Off => Off magic_quotes_sybase => Off => Off mail.force_extra_parameters => no value => no value max_execution_time => 0 => 30 max_input_time => -1 => -1 memory_limit => 8M => 8M open_basedir => no value => no value output_buffering => 0 => 0 output_handler => no value => no value post_max_size => 8M => 8M precision => 14 => 14 register_argc_argv => On => On register_globals => Off => Off register_long_arrays => On => On report_memleaks => On => On report_zend_debug => Off => Off safe_mode => On => On safe_mode_exec_dir => /usr/lib/php/bin => /usr/lib/php/bin safe_mode_gid => Off => Off safe_mode_include_dir => no value => no value sendmail_from => no value => no value sendmail_path => /usr/sbin/sendmail -t -i => /usr/sbin/sendmail -t -i serialize_precision => 100 => 100 short_open_tag => On => On SMTP => localhost => localhost smtp_port => 25 => 25 sql.safe_mode => Off => Off track_errors => Off => Off unserialize_callback_func => no value => no value upload_max_filesize => 2M => 2M upload_tmp_dir => no value => no value user_dir => no value => no value variables_order => EGPCS => EGPCS xmlrpc_error_number => 0 => 0 xmlrpc_errors => Off => Off y2k_compliance => On => On zend.ze1_compatibility_mode => Off => Off SQLite SQLite support => enabled PECL Module version => 1.1-dev $Id: sqlite.c,v 1.142 2004/04/22 22:34:29 iliaa Exp $ SQLite Library => 2.8.11 SQLite Encoding => iso8859 Directive => Local Value => Master Value sqlite.assoc_case => 0 => 0 SimpleXML Simplexml support => enabled Revision => $Revision: 1.138 $ Schema support => enabled bcmath BCMath support => enabled bz2 BZip2 Support => Enabled BZip2 Version => 1.0.2, 30-Dec-2001 calendar Calendar support => enabled ctype ctype functions => enabled curl CURL support => enabled CURL Information => libcurl/7.10.5 OpenSSL/0.9.7b ipv6 zlib/1.1.4 dba DBA support => enabled Supported handlers => gdbm ndbm cdb cdb_make inifile flatfile dom DOM/XML => enabled DOM/XML API Version => 20031129 libxml Version => 2.5.10 HTML Support => enabled XPath Support => enabled XPointer Support => enabled Schema Support => enabled RelaxNG Support => enabled exif EXIF Support => enabled EXIF Version => 1.4 $Id: exif.c,v 1.162 2004/03/16 20:58:01 derick Exp $ Supported EXIF Version => 0220 Supported filetypes => JPEG,TIFF ftp FTP support => enabled gd GD Support => enabled GD Version => bundled (2.0.22 compatible) FreeType Support => enabled FreeType Linkage => with freetype FreeType Version => 2.1.4 GIF Read Support => enabled JPG Support => enabled PNG Support => enabled WBMP Support => enabled XBM Support => enabled gettext GetText Support => enabled gmp gmp support => enabled iconv iconv support => enabled iconv implementation => glibc iconv library version => 2.3.2 Directive => Local Value => Master Value iconv.input_encoding => ISO-8859-1 => ISO-8859-1 iconv.internal_encoding => ISO-8859-1 => ISO-8859-1 iconv.output_encoding => ISO-8859-1 => ISO-8859-1 libxml libXML support => active libXML Version => 2.5.10 libXML streams => enabled mbstring Multibyte Support => enabled Multibyte string engine => libmbfl Multibyte (japanese) regex support => enabled Multibyte regex (oniguruma) version => 2.2.4 mbstring extension makes use of "streamable kanji code filter and converter", which is distributed under the GNU Lesser General Public License version 2.1. Directive => Local Value => Master Value mbstring.detect_order => no value => no value mbstring.encoding_translation => Off => Off mbstring.func_overload => 0 => 0 mbstring.http_input => pass => pass mbstring.http_output => pass => pass mbstring.internal_encoding => ISO-8859-1 => no value mbstring.language => neutral => neutral mbstring.substitute_character => no value => no value mcrypt mcrypt support => enabled Version => 2.5.7 Api No => 20021217 Supported ciphers => cast-128 gost rijndael-128 twofish arcfour cast-256 loki97 rijndael-192 saferplus wake blowfish-compat des rijndael-256 serpent xtea blowfish enigma rc2 tripledes Supported modes => cbc cfb ctr ecb ncfb nofb ofb stream Directive => Local Value => Master Value mcrypt.algorithms_dir => no value => no value mcrypt.modes_dir => no value => no value mhash MHASH support => Enabled MHASH API Version => 20020524 mysql MySQL Support => enabled Active Persistent Links => 0 Active Links => 0 Client API version => 4.0.20 MYSQL_MODULE_TYPE => external MYSQL_SOCKET => /var/lib/mysql/mysql.sock MYSQL_INCLUDE => -I/usr/include/mysql MYSQL_LIBS => -L/usr/lib -lmysqlclient Directive => Local Value => Master Value mysql.allow_persistent => On => On mysql.connect_timeout => 60 => 60 mysql.default_host => no value => no value mysql.default_password => no value => no value mysql.default_port => no value => no value mysql.default_socket => no value => no value mysql.default_user => no value => no value mysql.max_links => Unlimited => Unlimited mysql.max_persistent => Unlimited => Unlimited mysql.trace_mode => Off => Off openssl OpenSSL support => enabled OpenSSL Version => OpenSSL 0.9.7b 10 Apr 2003 pcre PCRE (Perl Compatible Regular Expressions) Support => enabled PCRE Library Version => 4.5 01-December-2003 posix Revision => $Revision: 1.60 $ session Session Support => enabled Registered save handlers => files user sqlite Registered serializer handlers => php php_binary wddx Directive => Local Value => Master Value session.auto_start => Off => Off session.bug_compat_42 => On => On session.bug_compat_warn => On => On session.cache_expire => 180 => 180 session.cache_limiter => nocache => nocache session.cookie_domain => no value => no value session.cookie_lifetime => 0 => 0 session.cookie_path => / => / session.cookie_secure => Off => Off session.entropy_file => no value => no value session.entropy_length => 0 => 0 session.gc_divisor => 100 => 100 session.gc_maxlifetime => 1440 => 1440 session.gc_probability => 1 => 1 session.hash_bits_per_character => 4 => 4 session.hash_function => 0 => 0 session.name => PHPSESSID => PHPSESSID session.referer_check => no value => no value session.save_handler => files => files session.save_path => no value => no value session.serialize_handler => php => php session.use_cookies => On => On session.use_only_cookies => Off => Off session.use_trans_sid => 0 => 0 shmop shmop support => enabled spl SPL support => enabled Interfaces => RecursiveIterator, SeekableIterator Classes => ArrayObject, ArrayIterator, CachingIterator, CachingRecursiveIterator, DirectoryIterator, FilterIterator, LimitIterator, ParentIterator, RecursiveDirectoryIterator, RecursiveIteratorIterator, SimpleXMLIterator standard Regex Library => Bundled library enabled Dynamic Library Support => enabled Path to sendmail => /usr/sbin/sendmail -t -i Directive => Local Value => Master Value assert.active => 1 => 1 assert.bail => 0 => 0 assert.callback => no value => no value assert.quiet_eval => 0 => 0 assert.warning => 1 => 1 auto_detect_line_endings => 0 => 0 date.default_latitude => 31.7667 => 31.7667 date.default_longitude => 35.2333 => 35.2333 date.sunrise_zenith => 90.83 => 90.83 date.sunset_zenith => 90.83 => 90.83 default_socket_timeout => 60 => 60 safe_mode_allowed_env_vars => PHP_ => PHP_ safe_mode_protected_env_vars => LD_LIBRARY_PATH => LD_LIBRARY_PATH url_rewriter.tags => a=href,area=href,frame=src,form=,fieldset= => a=href,area=href,frame=src,form=,fieldset= user_agent => no value => no value tokenizer Tokenizer Support => enabled wddx WDDX Support => enabled WDDX Session Serializer => enabled xml XML Support => active XML Namespace Support => active libxml2 Version => 2.5.10 zlib ZLib Support => enabled Compiled Version => 1.1.4 Linked Version => 1.1.4 Directive => Local Value => Master Value zlib.output_compression => Off => Off zlib.output_compression_level => -1 => -1 zlib.output_handler => no value => no value Additional Modules Module Name dbase filepro sysvsem sysvshm Environment Variable => Value LESSKEY => /etc/lesskey.bin MANPATH => /usr/local/man:/usr/share/man:/usr/X11R6/man:/opt/gnome/man INFODIR => /usr/local/info:/usr/share/info:/usr/info NNTPSERVER => news HOSTNAME => kafka TEST_PHP_SRCDIR => /usr/src/server/php-5.0.0RC2 XKEYSYMDB => /usr/X11R6/lib/X11/XKeysymDB SHELL => /bin/sh TERM => xterm HOST => kafka PROFILEREAD => true MAKEFLAGS => HISTSIZE => 1000 SSH_CLIENT => deleted GNOME_PATH => :/opt/gnome:/usr SSH_TTY => deleted USER => patrick LS_COLORS => no=00:fi=00:di=01;34:ln=00;36:pi=40;33:so=01;35:do=01;35:bd=40;33;01:cd=40;33;01:or=40;31:ex=00;32:*.cmd=01;32:*.exe=01;32:*.com=01;32:*.bat=01;32:*.btm=01;32:*.dll=01;32:*.tar=00;31:*.tbz=00;31:*.tgz=00;31:*.rpm=00;31:*.deb=00;31:*.arj=00;31:*.taz=00;31:*.lzh=00;31:*.zip=00;31:*.zoo=00;31:*.z=00;31:*.Z=00;31:*.gz=00;31:*.bz2=00;31:*.tb2=00;31:*.tz2=00;31:*.tbz2=00;31:*.avi=01;35:*.bmp=01;35:*.fli=01;35:*.gif=01;35:*.jpg=01;35:*.jpeg=01;35:*.mng=01;35:*.mov=01;35:*.mpg=01;35:*.pcx=01;35:*.pbm=01;35:*.pgm=01;35:*.png=01;35:*.ppm=01;35:*.tga=01;35:*.tif=01;35:*.xbm=01;35:*.xpm=01;35:*.dl=01;35:*.gl=01;35:*.aiff=00;32:*.au=00;32:*.mid=00;32:*.mp3=00;32:*.ogg=00;32:*.voc=00;32:*.wav=00;32: SCRIPT_FILENAME => XNLSPATH => /usr/X11R6/lib/X11/nls SSH_AUTH_SOCK => deleted HOSTTYPE => i386 MAKELEVEL => 1 PAGER => less MFLAGS => MINICOM => -c on PATH => /usr/sbin:/bin:/usr/bin:/sbin:/usr/X11R6/bin MAIL => /var/mail/patrick GNOMEDIR => /opt/gnome CPU => i686 _ => /usr/src/server/php-5.0.0RC2/sapi/cli/php PWD => /usr/src/server/php-5.0.0RC2 INPUTRC => /etc/inputrc EDITOR => /usr/bin/vim LANG => de_DE@euro TEST_PHP_EXECUTABLE => /usr/src/server/php-5.0.0RC2/sapi/cli/php REDIRECT_STATUS => PATH_TRANSLATED => TEXINPUTS => :/home/patrick/.TeX:/usr/share/doc/.TeX:/usr/doc/.TeX HOME => /root SHLVL => 4 CONTENT_LENGTH => OSTYPE => linux LESS_ADVANCED_PREPROCESSOR => no no_proxy => localhost LS_OPTIONS => -a -N --color=tty -T 0 WINDOWMANAGER => /usr/X11R6/bin/kde MACHTYPE => i686-suse-linux LOGNAME => patrick LESS => -M -I QUERY_STRING => SSH_CONNECTION => ::ffff:192.168.2.4 4565 ::ffff:192.168.2.6 22 LESSOPEN => lessopen.sh %s PKG_CONFIG_PATH => /opt/gnome/lib/pkgconfig INFOPATH => /usr/local/info:/usr/share/info:/usr/info:/opt/gnome/info ACLOCAL_PATH => /opt/gnome/share/aclocal CONTENT_TYPE => CC => gcc REQUEST_METHOD => LESSCLOSE => lessclose.sh %s %s G_BROKEN_FILENAMES => 1 COLORTERM => 1 PHP Variables Variable => Value _SERVER["LESSKEY"] => /etc/lesskey.bin _SERVER["MANPATH"] => /usr/local/man:/usr/share/man:/usr/X11R6/man:/opt/gnome/man _SERVER["INFODIR"] => /usr/local/info:/usr/share/info:/usr/info _SERVER["NNTPSERVER"] => news _SERVER["HOSTNAME"] => kafka _SERVER["TEST_PHP_SRCDIR"] => /usr/src/server/php-5.0.0RC2 _SERVER["XKEYSYMDB"] => /usr/X11R6/lib/X11/XKeysymDB _SERVER["SHELL"] => /bin/sh _SERVER["TERM"] => xterm _SERVER["HOST"] => kafka _SERVER["PROFILEREAD"] => true _SERVER["MAKEFLAGS"] => _SERVER["HISTSIZE"] => 1000 _SERVER["SSH_CLIENT"] => deleted _SERVER["GNOME_PATH"] => :/opt/gnome:/usr _SERVER["SSH_TTY"] => deleted _SERVER["USER"] => patrick _SERVER["LS_COLORS"] => no=00:fi=00:di=01;34:ln=00;36:pi=40;33:so=01;35:do=01;35:bd=40;33;01:cd=40;33;01:or=40;31:ex=00;32:*.cmd=01;32:*.exe=01;32:*.com=01;32:*.bat=01;32:*.btm=01;32:*.dll=01;32:*.tar=00;31:*.tbz=00;31:*.tgz=00;31:*.rpm=00;31:*.deb=00;31:*.arj=00;31:*.taz=00;31:*.lzh=00;31:*.zip=00;31:*.zoo=00;31:*.z=00;31:*.Z=00;31:*.gz=00;31:*.bz2=00;31:*.tb2=00;31:*.tz2=00;31:*.tbz2=00;31:*.avi=01;35:*.bmp=01;35:*.fli=01;35:*.gif=01;35:*.jpg=01;35:*.jpeg=01;35:*.mng=01;35:*.mov=01;35:*.mpg=01;35:*.pcx=01;35:*.pbm=01;35:*.pgm=01;35:*.png=01;35:*.ppm=01;35:*.tga=01;35:*.tif=01;35:*.xbm=01;35:*.xpm=01;35:*.dl=01;35:*.gl=01;35:*.aiff=00;32:*.au=00;32:*.mid=00;32:*.mp3=00;32:*.ogg=00;32:*.voc=00;32:*.wav=00;32: _SERVER["SCRIPT_FILENAME"] => _SERVER["XNLSPATH"] => /usr/X11R6/lib/X11/nls _SERVER["SSH_AUTH_SOCK"] => deleted _SERVER["HOSTTYPE"] => i386 _SERVER["MAKELEVEL"] => 1 _SERVER["PAGER"] => less _SERVER["MFLAGS"] => _SERVER["MINICOM"] => -c on _SERVER["PATH"] => /usr/sbin:/bin:/usr/bin:/sbin:/usr/X11R6/bin _SERVER["MAIL"] => /var/mail/patrick _SERVER["GNOMEDIR"] => /opt/gnome _SERVER["CPU"] => i686 _SERVER["_"] => /usr/src/server/php-5.0.0RC2/sapi/cli/php _SERVER["PWD"] => /usr/src/server/php-5.0.0RC2 _SERVER["INPUTRC"] => /etc/inputrc _SERVER["EDITOR"] => /usr/bin/vim _SERVER["LANG"] => de_DE@euro _SERVER["TEST_PHP_EXECUTABLE"] => /usr/src/server/php-5.0.0RC2/sapi/cli/php _SERVER["REDIRECT_STATUS"] => _SERVER["PATH_TRANSLATED"] => _SERVER["TEXINPUTS"] => :/home/patrick/.TeX:/usr/share/doc/.TeX:/usr/doc/.TeX _SERVER["HOME"] => /root _SERVER["SHLVL"] => 4 _SERVER["CONTENT_LENGTH"] => _SERVER["OSTYPE"] => linux _SERVER["LESS_ADVANCED_PREPROCESSOR"] => no _SERVER["no_proxy"] => localhost _SERVER["LS_OPTIONS"] => -a -N --color=tty -T 0 _SERVER["WINDOWMANAGER"] => /usr/X11R6/bin/kde _SERVER["MACHTYPE"] => i686-suse-linux _SERVER["LOGNAME"] => patrick _SERVER["LESS"] => -M -I _SERVER["QUERY_STRING"] => _SERVER["SSH_CONNECTION"] => ::ffff:192.168.2.4 4565 ::ffff:192.168.2.6 22 _SERVER["LESSOPEN"] => lessopen.sh %s _SERVER["PKG_CONFIG_PATH"] => /opt/gnome/lib/pkgconfig _SERVER["INFOPATH"] => /usr/local/info:/usr/share/info:/usr/info:/opt/gnome/info _SERVER["ACLOCAL_PATH"] => /opt/gnome/share/aclocal _SERVER["CONTENT_TYPE"] => _SERVER["CC"] => gcc _SERVER["REQUEST_METHOD"] => _SERVER["LESSCLOSE"] => lessclose.sh %s %s _SERVER["G_BROKEN_FILENAMES"] => 1 _SERVER["COLORTERM"] => 1 _SERVER["PHP_SELF"] => _SERVER["SCRIPT_NAME"] => _SERVER["DOCUMENT_ROOT"] => _SERVER["argv"] => Array ( ) _SERVER["argc"] => 0 _ENV["LESSKEY"] => /etc/lesskey.bin _ENV["MANPATH"] => /usr/local/man:/usr/share/man:/usr/X11R6/man:/opt/gnome/man _ENV["INFODIR"] => /usr/local/info:/usr/share/info:/usr/info _ENV["NNTPSERVER"] => news _ENV["HOSTNAME"] => kafka _ENV["TEST_PHP_SRCDIR"] => /usr/src/server/php-5.0.0RC2 _ENV["XKEYSYMDB"] => /usr/X11R6/lib/X11/XKeysymDB _ENV["SHELL"] => /bin/sh _ENV["TERM"] => xterm _ENV["HOST"] => kafka _ENV["PROFILEREAD"] => true _ENV["MAKEFLAGS"] => _ENV["HISTSIZE"] => 1000 _ENV["SSH_CLIENT"] => deleted _ENV["GNOME_PATH"] => :/opt/gnome:/usr _ENV["SSH_TTY"] => deleted _ENV["USER"] => patrick _ENV["LS_COLORS"] => no=00:fi=00:di=01;34:ln=00;36:pi=40;33:so=01;35:do=01;35:bd=40;33;01:cd=40;33;01:or=40;31:ex=00;32:*.cmd=01;32:*.exe=01;32:*.com=01;32:*.bat=01;32:*.btm=01;32:*.dll=01;32:*.tar=00;31:*.tbz=00;31:*.tgz=00;31:*.rpm=00;31:*.deb=00;31:*.arj=00;31:*.taz=00;31:*.lzh=00;31:*.zip=00;31:*.zoo=00;31:*.z=00;31:*.Z=00;31:*.gz=00;31:*.bz2=00;31:*.tb2=00;31:*.tz2=00;31:*.tbz2=00;31:*.avi=01;35:*.bmp=01;35:*.fli=01;35:*.gif=01;35:*.jpg=01;35:*.jpeg=01;35:*.mng=01;35:*.mov=01;35:*.mpg=01;35:*.pcx=01;35:*.pbm=01;35:*.pgm=01;35:*.png=01;35:*.ppm=01;35:*.tga=01;35:*.tif=01;35:*.xbm=01;35:*.xpm=01;35:*.dl=01;35:*.gl=01;35:*.aiff=00;32:*.au=00;32:*.mid=00;32:*.mp3=00;32:*.ogg=00;32:*.voc=00;32:*.wav=00;32: _ENV["SCRIPT_FILENAME"] => _ENV["XNLSPATH"] => /usr/X11R6/lib/X11/nls _ENV["SSH_AUTH_SOCK"] => deleted _ENV["HOSTTYPE"] => i386 _ENV["MAKELEVEL"] => 1 _ENV["PAGER"] => less _ENV["MFLAGS"] => _ENV["MINICOM"] => -c on _ENV["PATH"] => /usr/sbin:/bin:/usr/bin:/sbin:/usr/X11R6/bin _ENV["MAIL"] => /var/mail/patrick _ENV["GNOMEDIR"] => /opt/gnome _ENV["CPU"] => i686 _ENV["_"] => /usr/src/server/php-5.0.0RC2/sapi/cli/php _ENV["PWD"] => /usr/src/server/php-5.0.0RC2 _ENV["INPUTRC"] => /etc/inputrc _ENV["EDITOR"] => /usr/bin/vim _ENV["LANG"] => de_DE@euro _ENV["TEST_PHP_EXECUTABLE"] => /usr/src/server/php-5.0.0RC2/sapi/cli/php _ENV["REDIRECT_STATUS"] => _ENV["PATH_TRANSLATED"] => _ENV["TEXINPUTS"] => :/home/patrick/.TeX:/usr/share/doc/.TeX:/usr/doc/.TeX _ENV["HOME"] => /root _ENV["SHLVL"] => 4 _ENV["CONTENT_LENGTH"] => _ENV["OSTYPE"] => linux _ENV["LESS_ADVANCED_PREPROCESSOR"] => no _ENV["no_proxy"] => localhost _ENV["LS_OPTIONS"] => -a -N --color=tty -T 0 _ENV["WINDOWMANAGER"] => /usr/X11R6/bin/kde _ENV["MACHTYPE"] => i686-suse-linux _ENV["LOGNAME"] => patrick _ENV["LESS"] => -M -I _ENV["QUERY_STRING"] => _ENV["SSH_CONNECTION"] => ::ffff:192.168.2.4 4565 ::ffff:192.168.2.6 22 _ENV["LESSOPEN"] => lessopen.sh %s _ENV["PKG_CONFIG_PATH"] => /opt/gnome/lib/pkgconfig _ENV["INFOPATH"] => /usr/local/info:/usr/share/info:/usr/info:/opt/gnome/info _ENV["ACLOCAL_PATH"] => /opt/gnome/share/aclocal _ENV["CONTENT_TYPE"] => _ENV["CC"] => gcc _ENV["REQUEST_METHOD"] => _ENV["LESSCLOSE"] => lessclose.sh %s %s _ENV["G_BROKEN_FILENAMES"] => 1 _ENV["COLORTERM"] => 1 PHP License This program is free software; you can redistribute it and/or modify it under the terms of the PHP License as published by the PHP Group and included in the distribution in the file: LICENSE This program is distributed in the hope that it will be useful, but WITHOUT ANY WARRANTY; without even the implied warranty of MERCHANTABILITY or FITNESS FOR A PARTICULAR PURPOSE. If you did not receive a copy of the PHP license, or have any questions about PHP licensing, please contact license@php.net.

« previous php.qa (#17651) next »