Test results for 4.4.2RC2 [failed]

From: Date: Thu, 05 Jan 2006 16:03:58 +0000
Subject: Test results for 4.4.2RC2 [failed]
Groups: php.qa 
Request: Send a blank email to php-qa+get-26639@lists.php.net to get a copy of this message
===================================================================== FAILED TEST SUMMARY --------------------------------------------------------------------- Bug #24155 (gdImageRotate270 rotation problem). [ext/gd/tests/bug24155.phpt] Bug #27582 (ImageFillToBorder() on alphablending image looses alpha on fill color) [ext/gd/tests/bug27582_1.phpt] Bug #26463 (token_get_all() does not correctly handle semicolons after T_END_HEREDOC) [ext/tokenizer/tests/bug26463.phpt] ===================================================================== ===================================================================== TEST RESULT SUMMARY --------------------------------------------------------------------- Exts skipped : 64 Exts tested : 23 --------------------------------------------------------------------- Number of tests : 614 Tests skipped : 218 (35.5%) Tests warned : 0 (0.0%) Tests failed : 3 (0.5%) Tests passed : 393 (64.0%) --------------------------------------------------------------------- Time taken : 45 seconds ===================================================================== ================================================================================ /usr/src/php-4.4.2RC2/ext/gd/tests/bug24155.phpt ================================================================================ ---- EXPECTED OUTPUT cc867fd65c30883463ce58d0341f0997 ---- ACTUAL OUTPUT 409d70b5d493746acc2255c759d73436 ---- FAILED ================================================================================ 001- cc867fd65c30883463ce58d0341f0997 001+ 409d70b5d493746acc2255c759d73436 ================================================================================ ================================================================================ /usr/src/php-4.4.2RC2/ext/gd/tests/bug27582_1.phpt ================================================================================ ---- EXPECTED OUTPUT 08287f8f5d406946009df5f04ca83dc0 ---- ACTUAL OUTPUT b6d55b399e27b895a1fee8a137bb8470 ---- FAILED ================================================================================ 001- 08287f8f5d406946009df5f04ca83dc0 001+ b6d55b399e27b895a1fee8a137bb8470 ================================================================================ ================================================================================ /usr/src/php-4.4.2RC2/ext/tokenizer/tests/bug26463.phpt ================================================================================ ---- EXPECTED OUTPUT array(19) { [0]=ˆ\œ˜^J ŠHˆÌOO‚ˆ[ ͍ÊBˆÌWOO‚ˆÝš[™Ê ŠHÜˆ‚ˆBˆÌWO@¢'&’ƒ"’°¢³ÓÓ࢖çBƒ3’¢³ÓÓà¢7G&–ærƒ"’"G‚ ¢Т³%ÓÓà¢7G&–ærƒ’#Ò ¢³5ÓÓà¢'&’ƒ"’°¢³ÓÓ࢖çBƒ3s¢³ÓÐ(€€€ÍÑÉ¥¹œ Ø¤€ˆððñ(ˆ(€ô(€lÑtôø(€…ÉɅä È¤ì(€€€lÁtôø(€€€¥¹Ð ÌÀܤ(€€€lÅtô string(13) "jhdsjkfhjdsh " } [5]=> array(2) { [0]=ˆ[ Í̊BˆÌWOO‚ˆÝš[™Ê ŠH‘‚ˆBˆ͗O@¢'&’ƒ"’°¢³ÓÓ࢖çBƒ3s¢³ÓÓà¢7G&–ærƒ’ ¢ ¢Т³uÓÓà¢7G&–ærƒ’"â ¢³…ÓÓà¢'&’ƒ"’°¢³ÓÐ(€€€¥¹Ð ÌÄÔ¤(€€€lÅtôø(€€€ÍÑÉ¥¹œ È¤€ˆˆˆˆ(€ô(€låtô string(1) ";" [10]=> array(2) { [0]=ˆ[ ÍÌ BˆÌWOO‚ˆÝš[™Ê JH‚ˆ‚ˆBˆÌLWO@¢'&’ƒ"’°¢³ÓÓ࢖çBƒ3’¢³ÓÓà¢7G&–ærƒ"’"F ¢Т³%ÓÐ(€ÍÑÉ¥¹œ Ä¤€ˆôˆ(€lÄÍtôø(€…ÉɅä È¤ì(€€€lÁtô int(371) [1]=> string(8) "<<<DDDD " } [14]=> array(2) { [0]=ˆ[ Ì ÊBˆÌWOO‚ˆÝš[™Ê LÊHššښٚ™Úˆ‚ˆBˆÌMWOO‚ˆ\œ˜^J ŠHˆÌO@¢–çBƒ3s"¢³ÓÓà¢7G&–ærƒB’$DDDB ¢Т³eÓÐ(€ÍÑÉ¥¹œ Ä¤€ˆìˆ(€lÄÝtôø(€…ÉɅä È¤ì(€€€lÁtô int(370) [1]=> string(1) " " } [18]=ˆ\œ˜^J ŠHˆÌOO‚ˆ[ ͎JBˆÌWOO‚ˆÝš[™Ê ŠHÏˆ‚ˆBŸB‹KKKHPÕPSÕUU˜\œ˜^J NJHˆÌOO‚ˆ\œ˜^J ŠHˆÌOO‚ˆ[ ÍM BˆÌWO@¢7G&–ærƒb’#Ã÷‡

« previous php.qa (#26639) next »