Test results for 4.4.2RC2 [failed]

From: Date: Fri, 06 Jan 2006 13:20:08 +0000
Subject: Test results for 4.4.2RC2 [failed]
Groups: php.qa 
Request: Send a blank email to php-qa+get-26643@lists.php.net to get a copy of this message
===================================================================== FAILED TEST SUMMARY --------------------------------------------------------------------- Bug #24155 (gdImageRotate270 rotation problem). [ext/gd/tests/bug24155.phpt] Bug #27582 (ImageFillToBorder() on alphablending image looses alpha on fill color) [ext/gd/tests/bug27582_1.phpt] mb_strcut() [ext/mbstring/tests/mb_strcut.phpt] Bug #26463 (token_get_all() does not correctly handle semicolons after T_END_HEREDOC) [ext/tokenizer/tests/bug26463.phpt] ===================================================================== ===================================================================== TEST RESULT SUMMARY --------------------------------------------------------------------- Exts skipped : 67 Exts tested : 20 --------------------------------------------------------------------- Number of tests : 614 Tests skipped : 147 (23.9%) Tests warned : 0 (0.0%) Tests failed : 4 (0.7%) Tests passed : 463 (75.4%) --------------------------------------------------------------------- Time taken : 98 seconds ===================================================================== ================================================================================ /usr/local/src/php-4.4.2RC2/ext/gd/tests/bug24155.phpt ================================================================================ ---- EXPECTED OUTPUT cc867fd65c30883463ce58d0341f0997 ---- ACTUAL OUTPUT 409d70b5d493746acc2255c759d73436 ---- FAILED ================================================================================ 001- cc867fd65c30883463ce58d0341f0997 001+ 409d70b5d493746acc2255c759d73436 ================================================================================ ================================================================================ /usr/local/src/php-4.4.2RC2/ext/gd/tests/bug27582_1.phpt ================================================================================ ---- EXPECTED OUTPUT 08287f8f5d406946009df5f04ca83dc0 ---- ACTUAL OUTPUT b6d55b399e27b895a1fee8a137bb8470 ---- FAILED ================================================================================ 001- 08287f8f5d406946009df5f04ca83dc0 001+ b6d55b399e27b895a1fee8a137bb8470 ================================================================================ ================================================================================ /usr/local/src/php-4.4.2RC2/ext/mbstring/tests/mb_strcut.phpt ================================================================================ ---- EXPECTED OUTPUT ¤Îʸ 0123¤³¤Îʸ»³¼é3ñ¿2÷.;)1é.hhÑUPËR”)<®ò)0é1©))7©.hhñ¿2÷.;)3ó31woki)(h“Ò“ÒΈ LŒé,é3²®‹KKKHPÕPSÕUU©3²®Œ LŒé,é3²®.ìï:Lüo̽ˎÊLzKš4UT2Ô¥ O+¼ŠL:LjJJMêKš<o̽ˎÊLüÌÌ]ÛÚÚJJ0¤äs¢

« previous php.qa (#26643) next »