Bug #15803 Updated: Informix + IBM DB2 = Compile Failure

From: Date: Wed, 12 Jun 2002 17:49:14 +0000
Subject: Bug #15803 Updated: Informix + IBM DB2 = Compile Failure
References: 1  Groups: php.bugs 
Request: Send a blank email to php-bugs+get-10270@lists.php.net to get a copy of this message
ID: 15803 Updated by: kalowsky@php.net Reported By: truth@ichaos.com -Status: Open +Status: Feedback Bug Type: Compile Failure Operating System: Linux (RH7) PHP Version: 4.1.2 New Comment: 1) It looks like your DB2 include file isn't correct. The ODBCVER part really shouldn't be a problem, but the missing semi-colon line from you sqlcli1.h is. 2) I have no idea what causes the crash in odbc_connect. Can you please try compiling with the --enable-debug flag, crash the build, and send the backtrace? I don't have access to either database, so unfortunately I have no real answers for you. Previous Comments: ------------------------------------------------------------------------ [2002-06-12 13:24:34] truth@ichaos.com I can get them to compile using the following method: informix: static module DB2: shared module But now the server segfaults on odbc_connect calls. What would it take to get someone to fix this? I'd like to get our production servers off of version 4.0.4pl1!!! I'll give the person who fixes this $100 US Dollars. I have been struggling with this problem for almost 2 years now and NOBODY has helped. ------------------------------------------------------------------------ [2002-03-06 17:34:59] truth@ichaos.com Compile fails for version 4.1.2 all the way down to 4.0.5 Figured if I make it a bug for version 4.1.2 someone might actually look at it. ------------------------------------------------------------------------ [2002-02-28 22:00:17] truth@ichaos.com Compiling with support for both Informix and IBM DB2 worked in versions earlier than 4.0.5 (our prod servers are running 4.0.4pl1 just fine). I've tried compiling versions after 4.0.4pl1 and it fails for each one. The following is the configure line (and output). After that (seperated with several '=' characters) is the output of the "make" command. I've been trying to compile with any version of the Informix CSDK (Downloaded today) and IBM DB2 Connect and SDK (currently using 7.2). If I take out the --with-ibm-db2 or the --with-informix, the compile will succeed. I've tried putting the line '#include "ext/odbc/php_odbc.h"' before the line '#include "ext/informix/php_informix.h"' to make PHP compile, but then the IBM DB2 database functions don't act correctly. Queries that return data before the upgrade fail when using this "modified" version of 4.0.5. Please help as I would like to be able to fix the upload problems found recently and still have a functional application. Thanks, Tom ======================================================= truth@tiamat:~/src/php-4.1.2 > ./configure --with-gnu-ld --enable-inline-optimiz ation --enable-sysvshm --enable-sysvsem --with-regex=system --enable-trans-sid - -with-ibm-db2 --with-mysql --with-informix=/usr/local/Informix --with-apxs loading cache ./config.cache checking for a BSD compatible install... /usr/bin/install -c checking whether build environment is sane... yes checking whether make sets ${MAKE}... yes checking for working aclocal... found checking for working autoconf... found checking for working automake... found checking for working autoheader... found checking for working makeinfo... found checking whether to enable maintainer-specific portions of Makefiles... no checking host system type... i686-pc-linux-gnu checking for gawk... gawk checking for bison... bison -y checking bison version... 1.28 (ok) checking for gcc... gcc checking whether the C compiler (gcc ) works... yes checking whether the C compiler (gcc ) is a cross-compiler... no checking whether we are using GNU C... yes checking whether gcc accepts -g... yes checking how to run the C preprocessor... gcc -E checking for AIX... no checking for gcc option to accept ANSI C... none needed checking for ranlib... ranlib checking whether gcc and cc understand -c and -o together... yes checking whether ln -s works... yes checking for flex... flex checking for yywrap in -lfl... yes checking lex output file root... lex.yy checking whether yytext is a pointer... yes checking for working const... yes checking for pthreads_cflags... -pthread checking for pthreads_lib... Configuring SAPI modules checking for AOLserver support... no checking for Apache module support via DSO through APXS... yes checking for mod_charset compatibility option... no checking for Apache 2.0 module support via DSO through APXS... no checking for Caudium support... no checking for fhttpd module support... no checking for FastCGI support... no checking for Zeus ISAPI support... no checking for NSAPI support... no checking for PHTTPD support... no checking for Pi3Web Support... no checking for Roxen/Pike support... no checking for Servlet support... no checking for thttpd... no checking for TUX... no checking for chosen SAPI module... apache Running system checks checking for missing declarations of reentrant functions... done checking whether compiler supports -R... no checking whether compiler supports -Wl,-rpath,... yes checking for sendmail... /usr/sbin/sendmail checking whether system uses EBCDIC... no checking for socket in -lsocket... no checking for htonl in -lsocket... no checking for yp_get_default_domain... no checking for gethostname in -lnsl... yes checking for dlopen in -ldl... yes checking for sin in -lm... yes checking for inet_aton in -lresolv... yes checking for res_search in -lsocket... no checking for res_search in -lresolv... yes checking for ANSI C header files... yes checking for dirent.h that defines DIR... yes checking for opendir in -ldir... no checking for fclose declaration... ok checking for alloca.h... yes checking for arpa/inet.h... yes checking for arpa/nameser.h... yes checking for crypt.h... yes checking for fcntl.h... yes checking for grp.h... yes checking for ieeefp.h... no checking for langinfo.h... yes checking for limits.h... yes checking for locale.h... yes checking for netinet/in.h... yes checking for pwd.h... yes checking for resolv.h... yes checking for signal.h... yes checking for stdarg.h... yes checking for stdlib.h... yes checking for string.h... yes checking for syslog.h... yes checking for sysexits.h... yes checking for sys/file.h... yes checking for sys/mman.h... yes checking for sys/mount.h... yes checking for sys/resource.h... yes checking for sys/select.h... yes checking for sys/socket.h... yes checking for sys/statfs.h... yes checking for sys/statvfs.h... yes checking for sys/vfs.h... yes checking for sys/sysexits.h... no checking for sys/time.h... yes checking for sys/types.h... yes checking for sys/varargs.h... no checking for sys/wait.h... yes checking for unistd.h... yes checking for unix.h... no checking for utime.h... yes checking whether struct tm is in sys/time.h or time.h... time.h checking for tm_zone in struct tm... yes checking for tm_gmtoff in struct tm... yes checking for struct flock... yes checking for socklen_t... yes checking size of long... 4 checking size of int... 4 checking for st_blksize in struct stat... yes checking for st_blocks in struct stat... yes checking for st_rdev in struct stat... yes checking for size_t... yes checking for uid_t in sys/types.h... yes checking for IPv6 support... yes checking for vprintf... yes checking for asctime_r... yes checking for chroot... yes checking for ctime_r... yes checking for cuserid... yes checking for crypt... no checking for flock... yes checking for gai_strerror... yes checking for gcvt... yes checking for getlogin... yes checking for gethostbyaddr... yes checking for getprotobyname... yes checking for getprotobynumber... yes checking for getservbyname... yes checking for getservbyport... yes checking for getrusage... yes checking for gettimeofday... yes checking for gmtime_r... yes checking for inet_aton... yes checking for isascii... yes checking for link... yes checking for localtime_r... yes checking for lockf... yes checking for lrand48... yes checking for memcpy... yes checking for memmove... yes checking for mkstemp... yes checking for mmap... yes checking for nl_langinfo... yes checking for putenv... yes checking for realpath... yes checking for random... yes checking for rand_r... yes checking for regcomp... yes checking for res_search... yes checking for setitimer... yes checking for setlocale... yes checking for localeconv... yes checking for setsockopt... yes checking for setvbuf... yes checking for shutdown... yes checking for sin... yes checking for snprintf... yes checking for srand48... yes checking for srandom... yes checking for statfs... yes checking for statvfs... yes checking for std_syslog... no checking for strcasecmp... yes checking for strcoll... yes checking for strdup... yes checking for strerror... yes checking for strftime... yes checking for strstr... yes checking for strtok_r... yes checking for symlink... yes checking for tempnam... yes checking for tzset... yes checking for unsetenv... yes checking for usleep... yes checking for utime... yes checking for vsnprintf... yes checking for getaddrinfo... yes checking for strlcat... no checking for strlcpy... no checking for getopt... yes checking whether utime accepts a null argument... yes checking for working alloca.h... (cached) yes checking for alloca... yes checking whether sprintf is broken... no checking for declared timezone... yes checking for type of reentrant time-related functions... POSIX checking for readdir_r... yes checking for type of readdir_r... POSIX checking whether to include debugging symbols... no checking layout of installed files... yes checking path to configuration file... yes checking whether to install PEAR... yes checking whether to enable safe mode by default... no checking for safe mode exec dir... /usr/local/php/bin checking for OpenSSL support... no checking whether to enable PHP's own SIGCHLD handler... no checking whether to enable magic quotes by default... no checking whether to enable runpaths... yes checking whether to explicitly link against libgcc... no checking whether to enable short tags by default... yes checking whether to enable dmalloc... no checking whether to enable php streams... no checking for crypt in -lcrypt... yes Configuring extensions checking if the location of ZLIB install directory is defined... no checking whether to include ZLIB support... no checking for ASPELL support... no checking for bc style precision math functions... no checking for BZip2 support... no checking whether to enable calendar conversion support... no checking for CCVS support... no checking whether to include cpdflib support... no checking whether to include crack support... no checking whether to enable ctype support... no checking for CURL support... no checking for CyberCash support... no checking for cybermut support... no checking for cyrus imap support... no checking whether to include old xDBM support... no checking whether to enable DBA... no checking for GDBM support... no checking for NDBM support... no checking for Berkeley DB2 support... no checking for Berkeley DB3 support... no checking for DBM support... no checking for CDB support... no checking whether to enable DBA interface... no checking whether to enable the bundled dbase library... no checking for dbplus support... no checking whether to enable dbx support... no checking for DOM support... no checking whether to enable exif support... no checking for FrontBase SQL92 (fbsql) support... no checking for fdftk support... no checking whether to enable the bundled filePro support... no checking whether to add fribidi support... no checking whether to enable FTP support... no checking whether to include GD support... no checking whether to include GNU gettext support... no checking for gmp support... no checking for Hyperwave support... no checking for ICAP support... no checking for iconv support... no checking for IMAP support... no checking for Informix support... yes checking Informix version... 951 checking for Ingres II support... no checking for InterBase support... no checking for ircg support... no checking for Java support... no checking whether to include LDAP support... no checking whether to enable mailparse support... no checking whether to enable multibyte string support... no checking whether to enable japanese encoding translation... no checking for MCAL support... no checking for mcrypt support... no checking for mhash support... no checking whether to include ming support... no checking for mnoGoSearch support... no checking for mSQL support... no checking for Muscat support... no checking for MySQL support... yes checking for MySQL UNIX socket... /tmp/mysql.sock checking for inline... inline checking return type of signal handlers... void checking for ANSI C header files... (cached) yes checking for sgtty.h... yes checking for sys/ioctl.h... yes checking for fcntl.h... (cached) yes checking for float.h... yes checking for floatingpoint.h... no checking for ieeefp.h... (cached) no checking for limits.h... (cached) yes checking for memory.h... yes checking for pwd.h... (cached) yes checking for select.h... no checking for stdlib.h... (cached) yes checking for stddef.h... yes checking for strings.h... yes checking for string.h... (cached) yes checking for synch.h... no checking for sys/mman.h... (cached) yes checking for sys/socket.h... (cached) yes checking for sys/timeb.h... yes checking for sys/types.h... (cached) yes checking for sys/un.h... yes checking for sys/vadvise.h... no checking for sys/wait.h... (cached) yes checking for term.h... yes checking for unistd.h... (cached) yes checking for utime.h... (cached) yes checking for sys/utime.h... no checking for termio.h... yes checking for termios.h... yes checking for sched.h... yes checking for crypt.h... (cached) yes checking for alloca.h... (cached) yes checking size of char... 1 checking size of int... (cached) 4 checking size of long... (cached) 4 checking size of long long... 8 checking for size_t... (cached) yes checking whether time.h and sys/time.h may both be included... yes checking for uid_t in sys/types.h... (cached) yes checking for type ulong... yes checking for type uchar... no checking for type uint... yes checking for int8... no checking base type of last arg to accept... socklen_t checking return type of qsort... void checking for alarm... yes checking for bmove... no checking for chsize... no checking for ftruncate... yes checking for rint... yes checking for finite... yes checking for fpsetmask... no checking for fpresetsticky... no checking for cuserid... (cached) yes checking for fcntl... yes checking for fconvert... no checking for getrusage... (cached) yes checking for getpwuid... yes checking for getcwd... yes checking for getrlimit... yes checking for getwd... yes checking for index... yes checking for locking... no checking for longjmp... yes checking for perror... yes checking for pread... yes checking for realpath... (cached) yes checking for rename... yes checking for socket... yes checking for strnlen... yes checking for madvise... yes checking for strtoul... yes checking for strtoull... yes checking for snprintf... (cached) yes checking for tempnam... (cached) yes checking for thr_setconcurrency... no checking for gethostbyaddr_r... yes checking for gethostbyname_r... yes checking for getpwnam... yes checking for bfill... no checking for bzero... yes checking for bcmp... yes checking for strstr... (cached) yes checking for strpbrk... yes checking for strerror... (cached) yes checking for tell... no checking for atod... no checking for memcpy... (cached) yes checking for memmove... (cached) yes checking for setupterm... no checking for strcasecmp... (cached) yes checking for sighold... yes checking for vidattr... no checking for setupterm... (cached) no checking for lrand48... (cached) yes checking for localtime_r... (cached) yes checking for sigset... yes checking for sigthreadmask... no checking for pthread_sigmask... no checking for pthread_setprio... no checking for pthread_setprio_np... no checking for pthread_setschedparam... yes checking for pthread_attr_setprio... no checking for pthread_attr_setschedparam... yes checking for pthread_attr_create... no checking for pthread_getsequence_np... no checking for pthread_attr_setstacksize... no checking for pthread_condattr_create... no checking for rwlock_init... no checking for crypt... (cached) no checking for dlopen... yes checking for dlerror... yes checking for fchmod... yes checking for getpass... yes checking for getpassphrase... no checking for strtok_r... (cached) yes checking style of gethostname_r routines... glibc2 checking 3 argument to gethostname_r routines... char checking args to pthread_getspecific... POSIX checking args to pthread_mutex_init... POSIX checking args to readdir_r... POSIX checking style of sigwait... POSIX checking for ncurses support... no checking for Oracle-OCI8 support... no checking for Adabas support... no checking for SAP DB support... no checking for Solid support... no checking for IBM DB2 support... yes checking for Oracle-ORACLE support... no checking for Ovrimos SQL Server support... no checking whether to enable pcntl support... no checking whether to include PCRE support... yes checking for memmove... (cached) yes checking whether to include PDFlib support... no checking whether to include Verisign Payflow Pro support... no checking for PostgreSQL support... no checking whether to include POSIX-like functions... yes checking for seteuid... yes checking for setegid... yes checking for setsid... yes checking for getsid... yes checking for setpgid... yes checking for getpgid... yes checking for ctermid... yes checking for mkfifo... yes checking for getrlimit... (cached) yes checking whether to include pspell support... no checking whether to include QDOM support... no checking for libedit readline replacement... no checking for readline support... no checking for recode support... no checking whether to enable CORBA support via Satellite... no checking for mm support... no checking whether to enable transparent session id propagation... yes checking whether to enable session support... yes checking for pread... (cached) yes checking for pwrite... yes checking whether pwrite works without custom declaration... yes checking whether pread works without custom declaration... yes checking whether to enable shmop support... no checking for SNMP support... no checking whether to enable UCD SNMP hack... no checking whether to enable sockets support... no checking for dlopen... (cached) yes checking for pam_start in -lpam... yes checking for getcwd... (cached) yes checking for getwd... (cached) yes checking for standard DES crypt... yes checking for extended DES crypt... no checking for MD5 crypt... yes checking for Blowfish crypt... no checking whether flush should be called explicitly after a bufferered io... no checking for libswf support... no checking for Sybase support... no checking for Sybase-CT support... no checking whether to enable System V semaphore support... yes checking for union semun... no checking whether to enable System V shared memory support... yes checking for vpopmail support... no checking for WDDX support... no checking whether byte ordering is bigendian... no checking for XML support... yes checking external libexpat install dir... no checking for XMLRPC-EPI support... no checking libexpat dir for XMLRPC-EPI... no checking whether to enable xslt support... no checking whether to enable the XSLT Sablotron backend... no checking libexpat dir for Sablotron XSL support... no checking for YAZ support... no checking whether to include YP support... no checking whether to include zziplib support... no checking whether to enable versioning... no checking which regex library to use... system Configuring Zend checking bison version... 1.28 (ok) checking for limits.h... (cached) yes checking for malloc.h... yes checking for string.h... (cached) yes checking for unistd.h... (cached) yes checking for stdarg.h... (cached) yes checking for sys/types.h... (cached) yes checking for sys/time.h... (cached) yes checking for signal.h... (cached) yes checking for unix.h... (cached) no checking for dlfcn.h... yes checking for size_t... (cached) yes checking return type of signal handlers... (cached) void checking for dlopen in -ldl... (cached) yes checking for dlopen... (cached) yes checking for uint... yes checking for ulong... yes checking for vprintf... (cached) yes checking for 8-bit clean memcmp... yes checking for working alloca.h... (cached) yes checking for alloca... (cached) yes checking for memcpy... (cached) yes checking for strdup... (cached) yes checking for getpid... yes checking for kill... yes checking for strtod... yes checking for strtol... yes checking for finite... (cached) yes checking for fpclass... no checking whether sprintf is broken... (cached) no checking for finite... (cached) yes checking for isfinite... no checking for isinf... yes checking for isnan... yes checking whether fp_except is defined... no checking whether to enable experimental ZTS... no checking whether to enable inline optimization for GCC... yes checking whether to enable a memory limit... no checking whether to enable Zend debugging... no checking for inline... (cached) inline Configuring TSRM checking for stdarg.h... (cached) yes Configuring libtool checking for Cygwin environment... no checking for mingw32 environment... no checking build system type... i686-pc-linux-gnu checking for ld used by GCC... /usr/i486-suse-linux/bin/ld checking if the linker (/usr/i486-suse-linux/bin/ld) is GNU ld... yes checking for /usr/i486-suse-linux/bin/ld option to reload object files... -r checking for BSD-compatible nm... /usr/bin/nm -B checking how to recognise dependant libraries... pass_all checking for object suffix... o checking for executable suffix... no checking command to parse /usr/bin/nm -B output... ok checking for dlfcn.h... (cached) yes checking for ranlib... (cached) ranlib checking for strip... strip checking for objdir... .libs checking for gcc option to produce PIC... -fPIC checking if gcc PIC flag -fPIC works... yes checking if gcc static flag -static works... yes checking if gcc supports -c -o file.o... yes checking if gcc supports -c -o file.lo... yes checking if gcc supports -fno-rtti -fno-exceptions... yes checking whether the linker (/usr/i486-suse-linux/bin/ld) supports shared librar ies... yes checking how to hardcode library paths into programs... immediate checking whether stripping libraries is possible... yes checking dynamic linker characteristics... GNU/Linux ld.so checking if libtool supports shared libraries... yes checking whether to build shared libraries... yes checking whether to build static libraries... no checking whether -lc should be explicitly linked in... no creating libtool Generating files checking for working mkdir -p... yes creating config_vars.mk updating cache ./config.cache creating ./config.status creating php4.spec creating Zend/Makefile creating main/build-defs.h creating pear/scripts/pear creating pear/scripts/phpize creating pear/scripts/php-config creating pear/scripts/pearize creating pear/scripts/phptar creating TSRM/Makefile creating main/php_config.h creating sapi/Makefile creating ext/Makefile creating Makefile creating pear/Makefile creating main/Makefile creating ext/informix/Makefile creating ext/mysql/Makefile creating ext/mysql/libmysql/Makefile creating ext/odbc/Makefile creating ext/pcre/Makefile creating ext/pcre/pcrelib/Makefile creating ext/posix/Makefile creating ext/session/Makefile creating ext/standard/Makefile creating ext/sysvsem/Makefile creating ext/sysvshm/Makefile creating ext/xml/Makefile creating ext/xml/expat/Makefile creating sapi/apache/Makefile creating number.c creating number.h creating main/internal_functions.c +--------------------------------------------------------------------+ | *** WARNING *** | | | | You chose to compile PHP with the built-in MySQL support. If you | | are compiling a server module, and intend to use other server | | modules that also use MySQL (e.g, mod_auth_mysql, PHP 3.0, | | mod_perl) you must NOT rely on PHP's built-in MySQL support, and | | instead build it with your local MySQL support files, by adding | | --with-mysql=/path/to/mysql to your configure line. | +--------------------------------------------------------------------+ | License: | | This software is subject to the PHP License, available in this | | distribution in the file LICENSE. By continuing this installation | | process, you are bound by the terms of this license agreement. | | If you do not agree with the terms of this license, you must abort | | the installation process at this point. | +--------------------------------------------------------------------+ Thank you for using PHP. ============================================ truth@tiamat:~/src/php-4.1.2 > make Making all in Zend make[1]: Entering directory `/home/truth/src/php-4.1.2/Zend' /bin/sh ../libtool --silent --mode=compile gcc -DHAVE_CONFIG_H -I. -I. -I../main -DEAPI_MM -DSINGLE_LISTEN_UNSERIALIZED_ACCEPT -D_LARGEFILE_SOURCE -D_FILE_OFF SET_BITS=64 -DHARD_SERVER_LIMIT=2048 -DDYNAMIC_MODULE_LIMIT=128 -DLINUX=2 -DMOD_ SSL=207101 -DEAPI -DUSE_EXPAT -I../TSRM -g -O2 -prefer-pic -c zend_language_par ser.c /bin/sh ../libtool --silent --mode=compile gcc -DHAVE_CONFIG_H -I. -I. -I../main -DEAPI_MM -DSINGLE_LISTEN_UNSERIALIZED_ACCEPT -D_LARGEFILE_SOURCE -D_FILE_OFF SET_BITS=64 -DHARD_SERVER_LIMIT=2048 -DDYNAMIC_MODULE_LIMIT=128 -DLINUX=2 -DMOD_ SSL=207101 -DEAPI -DUSE_EXPAT -I../TSRM -g -O2 -prefer-pic -c zend_language_sca nner.c /bin/sh ../libtool --silent --mode=compile gcc -DHAVE_CONFIG_H -I. -I. -I../main -DEAPI_MM -DSINGLE_LISTEN_UNSERIALIZED_ACCEPT -D_LARGEFILE_SOURCE -D_FILE_OFF SET_BITS=64 -DHARD_SERVER_LIMIT=2048 -DDYNAMIC_MODULE_LIMIT=128 -DLINUX=2 -DMOD_ SSL=207101 -DEAPI -DUSE_EXPAT -I../TSRM -g -O2 -prefer-pic -c zend_ini_parser.c /bin/sh ../libtool --silent --mode=compile gcc -DHAVE_CONFIG_H -I. -I. -I../main -DEAPI_MM -DSINGLE_LISTEN_UNSERIALIZED_ACCEPT -D_LARGEFILE_SOURCE -D_FILE_OFF SET_BITS=64 -DHARD_SERVER_LIMIT=2048 -DDYNAMIC_MODULE_LIMIT=128 -DLINUX=2 -DMOD_ SSL=207101 -DEAPI -DUSE_EXPAT -I../TSRM -g -O2 -prefer-pic -c zend_ini_scanner. c /bin/sh ../libtool --silent --mode=compile gcc -DHAVE_CONFIG_H -I. -I. -I../main -DEAPI_MM -DSINGLE_LISTEN_UNSERIALIZED_ACCEPT -D_LARGEFILE_SOURCE -D_FILE_OFF SET_BITS=64 -DHARD_SERVER_LIMIT=2048 -DDYNAMIC_MODULE_LIMIT=128 -DLINUX=2 -DMOD_ SSL=207101 -DEAPI -DUSE_EXPAT -I../TSRM -g -O2 -prefer-pic -c zend_alloc.c /bin/sh ../libtool --silent --mode=compile gcc -DHAVE_CONFIG_H -I. -I. -I../main -DEAPI_MM -DSINGLE_LISTEN_UNSERIALIZED_ACCEPT -D_LARGEFILE_SOURCE -D_FILE_OFF SET_BITS=64 -DHARD_SERVER_LIMIT=2048 -DDYNAMIC_MODULE_LIMIT=128 -DLINUX=2 -DMOD_ SSL=207101 -DEAPI -DUSE_EXPAT -I../TSRM -g -O2 -prefer-pic -c zend_compile.c /bin/sh ../libtool --silent --mode=compile gcc -DHAVE_CONFIG_H -I. -I. -I../main -DEAPI_MM -DSINGLE_LISTEN_UNSERIALIZED_ACCEPT -D_LARGEFILE_SOURCE -D_FILE_OFF SET_BITS=64 -DHARD_SERVER_LIMIT=2048 -DDYNAMIC_MODULE_LIMIT=128 -DLINUX=2 -DMOD_ SSL=207101 -DEAPI -DUSE_EXPAT -I../TSRM -g -O2 -prefer-pic -c zend_constants.c /bin/sh ../libtool --silent --mode=compile gcc -DHAVE_CONFIG_H -I. -I. -I../main -DEAPI_MM -DSINGLE_LISTEN_UNSERIALIZED_ACCEPT -D_LARGEFILE_SOURCE -D_FILE_OFF SET_BITS=64 -DHARD_SERVER_LIMIT=2048 -DDYNAMIC_MODULE_LIMIT=128 -DLINUX=2 -DMOD_ SSL=207101 -DEAPI -DUSE_EXPAT -I../TSRM -g -O2 -prefer-pic -c zend_dynamic_arra y.c /bin/sh ../libtool --silent --mode=compile gcc -DHAVE_CONFIG_H -I. -I. -I../main -DEAPI_MM -DSINGLE_LISTEN_UNSERIALIZED_ACCEPT -D_LARGEFILE_SOURCE -D_FILE_OFFS ET_BITS=64 -DHARD_SERVER_LIMIT=2048 -DDYNAMIC_MODULE_LIMIT=128 -DLINUX=2 -DMOD_S SL=207101 -DEAPI -DUSE_EXPAT -I../TSRM -g -O2 -prefer-pic -c ./zend_execute.c /bin/sh ../libtool --silent --mode=compile gcc -DHAVE_CONFIG_H -I. -I. -I../main -DEAPI_MM -DSINGLE_LISTEN_UNSERIALIZED_ACCEPT -D_LARGEFILE_SOURCE -D_FILE_OFF SET_BITS=64 -DHARD_SERVER_LIMIT=2048 -DDYNAMIC_MODULE_LIMIT=128 -DLINUX=2 -DMOD_ SSL=207101 -DEAPI -DUSE_EXPAT -I../TSRM -g -O2 -prefer-pic -c zend_execute_API. c /bin/sh ../libtool --silent --mode=compile gcc -DHAVE_CONFIG_H -I. -I. -I../main -DEAPI_MM -DSINGLE_LISTEN_UNSERIALIZED_ACCEPT -D_LARGEFILE_SOURCE -D_FILE_OFF SET_BITS=64 -DHARD_SERVER_LIMIT=2048 -DDYNAMIC_MODULE_LIMIT=128 -DLINUX=2 -DMOD_ SSL=207101 -DEAPI -DUSE_EXPAT -I../TSRM -g -O2 -prefer-pic -c zend_highlight.c /bin/sh ../libtool --silent --mode=compile gcc -DHAVE_CONFIG_H -I. -I. -I../main -DEAPI_MM -DSINGLE_LISTEN_UNSERIALIZED_ACCEPT -D_LARGEFILE_SOURCE -D_FILE_OFF SET_BITS=64 -DHARD_SERVER_LIMIT=2048 -DDYNAMIC_MODULE_LIMIT=128 -DLINUX=2 -DMOD_ SSL=207101 -DEAPI -DUSE_EXPAT -I../TSRM -g -O2 -prefer-pic -c zend_llist.c /bin/sh ../libtool --silent --mode=compile gcc -DHAVE_CONFIG_H -I. -I. -I../main -DEAPI_MM -DSINGLE_LISTEN_UNSERIALIZED_ACCEPT -D_LARGEFILE_SOURCE -D_FILE_OFF SET_BITS=64 -DHARD_SERVER_LIMIT=2048 -DDYNAMIC_MODULE_LIMIT=128 -DLINUX=2 -DMOD_ SSL=207101 -DEAPI -DUSE_EXPAT -I../TSRM -g -O2 -prefer-pic -c zend_opcode.c /bin/sh ../libtool --silent --mode=compile gcc -DHAVE_CONFIG_H -I. -I. -I../main -DEAPI_MM -DSINGLE_LISTEN_UNSERIALIZED_ACCEPT -D_LARGEFILE_SOURCE -D_FILE_OFF SET_BITS=64 -DHARD_SERVER_LIMIT=2048 -DDYNAMIC_MODULE_LIMIT=128 -DLINUX=2 -DMOD_ SSL=207101 -DEAPI -DUSE_EXPAT -I../TSRM -g -O2 -prefer-pic -c zend_operators.c /bin/sh ../libtool --silent --mode=compile gcc -DHAVE_CONFIG_H -I. -I. -I../main -DEAPI_MM -DSINGLE_LISTEN_UNSERIALIZED_ACCEPT -D_LARGEFILE_SOURCE -D_FILE_OFF SET_BITS=64 -DHARD_SERVER_LIMIT=2048 -DDYNAMIC_MODULE_LIMIT=128 -DLINUX=2 -DMOD_ SSL=207101 -DEAPI -DUSE_EXPAT -I../TSRM -g -O2 -prefer-pic -c zend_ptr_stack.c /bin/sh ../libtool --silent --mode=compile gcc -DHAVE_CONFIG_H -I. -I. -I../main -DEAPI_MM -DSINGLE_LISTEN_UNSERIALIZED_ACCEPT -D_LARGEFILE_SOURCE -D_FILE_OFF SET_BITS=64 -DHARD_SERVER_LIMIT=2048 -DDYNAMIC_MODULE_LIMIT=128 -DLINUX=2 -DMOD_ SSL=207101 -DEAPI -DUSE_EXPAT -I../TSRM -g -O2 -prefer-pic -c zend_stack.c /bin/sh ../libtool --silent --mode=compile gcc -DHAVE_CONFIG_H -I. -I. -I../main -DEAPI_MM -DSINGLE_LISTEN_UNSERIALIZED_ACCEPT -D_LARGEFILE_SOURCE -D_FILE_OFF SET_BITS=64 -DHARD_SERVER_LIMIT=2048 -DDYNAMIC_MODULE_LIMIT=128 -DLINUX=2 -DMOD_ SSL=207101 -DEAPI -DUSE_EXPAT -I../TSRM -g -O2 -prefer-pic -c zend_variables.c /bin/sh ../libtool --silent --mode=compile gcc -DHAVE_CONFIG_H -I. -I. -I../main -DEAPI_MM -DSINGLE_LISTEN_UNSERIALIZED_ACCEPT -D_LARGEFILE_SOURCE -D_FILE_OFF SET_BITS=64 -DHARD_SERVER_LIMIT=2048 -DDYNAMIC_MODULE_LIMIT=128 -DLINUX=2 -DMOD_ SSL=207101 -DEAPI -DUSE_EXPAT -I../TSRM -g -O2 -prefer-pic -c zend.c /bin/sh ../libtool --silent --mode=compile gcc -DHAVE_CONFIG_H -I. -I. -I../main -DEAPI_MM -DSINGLE_LISTEN_UNSERIALIZED_ACCEPT -D_LARGEFILE_SOURCE -D_FILE_OFF SET_BITS=64 -DHARD_SERVER_LIMIT=2048 -DDYNAMIC_MODULE_LIMIT=128 -DLINUX=2 -DMOD_ SSL=207101 -DEAPI -DUSE_EXPAT -I../TSRM -g -O2 -prefer-pic -c zend_API.c /bin/sh ../libtool --silent --mode=compile gcc -DHAVE_CONFIG_H -I. -I. -I../main -DEAPI_MM -DSINGLE_LISTEN_UNSERIALIZED_ACCEPT -D_LARGEFILE_SOURCE -D_FILE_OFF SET_BITS=64 -DHARD_SERVER_LIMIT=2048 -DDYNAMIC_MODULE_LIMIT=128 -DLINUX=2 -DMOD_ SSL=207101 -DEAPI -DUSE_EXPAT -I../TSRM -g -O2 -prefer-pic -c zend_extensions.c /bin/sh ../libtool --silent --mode=compile gcc -DHAVE_CONFIG_H -I. -I. -I../main -DEAPI_MM -DSINGLE_LISTEN_UNSERIALIZED_ACCEPT -D_LARGEFILE_SOURCE -D_FILE_OFF SET_BITS=64 -DHARD_SERVER_LIMIT=2048 -DDYNAMIC_MODULE_LIMIT=128 -DLINUX=2 -DMOD_ SSL=207101 -DEAPI -DUSE_EXPAT -I../TSRM -g -O2 -prefer-pic -c zend_hash.c /bin/sh ../libtool --silent --mode=compile gcc -DHAVE_CONFIG_H -I. -I. -I../main -DEAPI_MM -DSINGLE_LISTEN_UNSERIALIZED_ACCEPT -D_LARGEFILE_SOURCE -D_FILE_OFF SET_BITS=64 -DHARD_SERVER_LIMIT=2048 -DDYNAMIC_MODULE_LIMIT=128 -DLINUX=2 -DMOD_ SSL=207101 -DEAPI -DUSE_EXPAT -I../TSRM -g -O2 -prefer-pic -c zend_list.c /bin/sh ../libtool --silent --mode=compile gcc -DHAVE_CONFIG_H -I. -I. -I../main -DEAPI_MM -DSINGLE_LISTEN_UNSERIALIZED_ACCEPT -D_LARGEFILE_SOURCE -D_FILE_OFF SET_BITS=64 -DHARD_SERVER_LIMIT=2048 -DDYNAMIC_MODULE_LIMIT=128 -DLINUX=2 -DMOD_ SSL=207101 -DEAPI -DUSE_EXPAT -I../TSRM -g -O2 -prefer-pic -c zend_indent.c /bin/sh ../libtool --silent --mode=compile gcc -DHAVE_CONFIG_H -I. -I. -I../main -DEAPI_MM -DSINGLE_LISTEN_UNSERIALIZED_ACCEPT -D_LARGEFILE_SOURCE -D_FILE_OFF SET_BITS=64 -DHARD_SERVER_LIMIT=2048 -DDYNAMIC_MODULE_LIMIT=128 -DLINUX=2 -DMOD_ SSL=207101 -DEAPI -DUSE_EXPAT -I../TSRM -g -O2 -prefer-pic -c zend_builtin_func tions.c /bin/sh ../libtool --silent --mode=compile gcc -DHAVE_CONFIG_H -I. -I. -I../main -DEAPI_MM -DSINGLE_LISTEN_UNSERIALIZED_ACCEPT -D_LARGEFILE_SOURCE -D_FILE_OFF SET_BITS=64 -DHARD_SERVER_LIMIT=2048 -DDYNAMIC_MODULE_LIMIT=128 -DLINUX=2 -DMOD_ SSL=207101 -DEAPI -DUSE_EXPAT -I../TSRM -g -O2 -prefer-pic -c zend_sprintf.c /bin/sh ../libtool --silent --mode=compile gcc -DHAVE_CONFIG_H -I. -I. -I../main -DEAPI_MM -DSINGLE_LISTEN_UNSERIALIZED_ACCEPT -D_LARGEFILE_SOURCE -D_FILE_OFF SET_BITS=64 -DHARD_SERVER_LIMIT=2048 -DDYNAMIC_MODULE_LIMIT=128 -DLINUX=2 -DMOD_ SSL=207101 -DEAPI -DUSE_EXPAT -I../TSRM -g -O2 -prefer-pic -c zend_ini.c /bin/sh ../libtool --silent --mode=link gcc -g -O2 -prefer-pic -o libZend.la -L/home/db2inst1/sqllib/lib -ldb2 -lpam -lifsql -lifasf -lifgen -lifos -lifgls -ldl -lcrypt -lphpifx -lifglx -ldl -lcrypt -lresolv -lm -ldl -lnsl -lresolv -lc rypt zend_language_parser.lo zend_language_scanner.lo zend_ini_parser.lo zend_i ni_scanner.lo zend_alloc.lo zend_compile.lo zend_constants.lo zend_dynamic_array .lo zend_execute.lo zend_execute_API.lo zend_highlight.lo zend_llist.lo zend_opc ode.lo zend_operators.lo zend_ptr_stack.lo zend_stack.lo zend_variables.lo zend. lo zend_API.lo zend_extensions.lo zend_hash.lo zend_list.lo zend_indent.lo zend_ builtin_functions.lo zend_sprintf.lo zend_ini.lo make[1]: Leaving directory `/home/truth/src/php-4.1.2/Zend' Making all in main make[1]: Entering directory `/home/truth/src/php-4.1.2/main' make[2]: Entering directory `/home/truth/src/php-4.1.2/main' /bin/sh /home/truth/src/php-4.1.2/libtool --silent --mode=compile gcc -I. -I/ho me/truth/src/php-4.1.2/main -I/home/truth/src/php-4.1.2/main -I/home/truth/src/p hp-4.1.2 -I/usr/include/apache -I/home/truth/src/php-4.1.2/Zend -I/usr/local/Inf ormix/incl/esql -I/home/truth/src/php-4.1.2/ext/mysql/libmysql -I/home/db2inst1/ sqllib/include -I/home/truth/src/php-4.1.2/ext/xml/expat -DEAPI_MM -DSINGLE_LIS TEN_UNSERIALIZED_ACCEPT -D_LARGEFILE_SOURCE -D_FILE_OFFSET_BITS=64 -DHARD_SERVER _LIMIT=2048 -DDYNAMIC_MODULE_LIMIT=128 -DLINUX=2 -DMOD_SSL=207101 -DEAPI -DUSE_E XPAT -I/home/truth/src/php-4.1.2/TSRM -g -O2 -prefer-pic -c main.c /bin/sh /home/truth/src/php-4.1.2/libtool --silent --mode=compile gcc -I. -I/ho me/truth/src/php-4.1.2/main -I/home/truth/src/php-4.1.2/main -I/home/truth/src/p hp-4.1.2 -I/usr/include/apache -I/home/truth/src/php-4.1.2/Zend -I/usr/local/Inf ormix/incl/esql -I/home/truth/src/php-4.1.2/ext/mysql/libmysql -I/home/db2inst1/ sqllib/include -I/home/truth/src/php-4.1.2/ext/xml/expat -DEAPI_MM -DSINGLE_LIS TEN_UNSERIALIZED_ACCEPT -D_LARGEFILE_SOURCE -D_FILE_OFFSET_BITS=64 -DHARD_SERVER _LIMIT=2048 -DDYNAMIC_MODULE_LIMIT=128 -DLINUX=2 -DMOD_SSL=207101 -DEAPI -DUSE_E XPAT -I/home/truth/src/php-4.1.2/TSRM -g -O2 -prefer-pic -c internal_functions. c In file included from /home/db2inst1/sqllib/include/sqlcli1.h:42, from /home/truth/src/php-4.1.2/ext/odbc/php_odbc.h:178, from internal_functions.c:34: /home/db2inst1/sqllib/include/sqlcli.h:718: warning: `ODBCVER' redefined /home/truth/src/php-4.1.2/ext/odbc/php_odbc.h:27: warning: this is the location of the previous definition In file included from /home/db2inst1/sqllib/include/sqlcli1.h:42, from /home/truth/src/php-4.1.2/ext/odbc/php_odbc.h:178, from internal_functions.c:34: /home/db2inst1/sqllib/include/sqlcli.h:323: parse error before `7' /home/db2inst1/sqllib/include/sqlcli.h:326: parse error before `5' /home/db2inst1/sqllib/include/sqlcli.h:349: parse error before `0' /home/db2inst1/sqllib/include/sqlcli.h:355: parse error before `3' /home/db2inst1/sqllib/include/sqlcli.h:489: parse error before `14' /home/db2inst1/sqllib/include/sqlcli.h:508: parse error before `14' /home/db2inst1/sqllib/include/sqlcli.h:508: warning: no semicolon at end of stru ct or union /home/db2inst1/sqllib/include/sqlcli.h:515: parse error before `}' /home/db2inst1/sqllib/include/sqlcli.h:515: warning: data definition has no type or storage class /home/db2inst1/sqllib/include/sqlcli.h:524: parse error before `0' /home/db2inst1/sqllib/include/sqlcli.h:524: warning: no semicolon at end of stru ct or union /home/db2inst1/sqllib/include/sqlcli.h:526: parse error before `0' /home/db2inst1/sqllib/include/sqlcli.h:528: warning: data definition has no type or storage class /home/db2inst1/sqllib/include/sqlcli.h:568: parse error before `0' /home/db2inst1/sqllib/include/sqlcli.h:577: parse error before `0' /home/db2inst1/sqllib/include/sqlcli.h:590: parse error before `0' /home/db2inst1/sqllib/include/sqlcli.h:597: parse error before `0' /home/db2inst1/sqllib/include/sqlcli.h:614: parse error before `0' /home/db2inst1/sqllib/include/sqlcli.h:629: parse error before `0' /home/db2inst1/sqllib/include/sqlcli.h:636: parse error before `0' /home/db2inst1/sqllib/include/sqlcli.h:662: parse error before `0' /home/db2inst1/sqllib/include/sqlcli.h:685: parse error before `0' In file included from /home/db2inst1/sqllib/include/sqlcli.h:725, from /home/db2inst1/sqllib/include/sqlcli1.h:42, from /home/truth/src/php-4.1.2/ext/odbc/php_odbc.h:178, from internal_functions.c:34: /home/db2inst1/sqllib/include/sqlext.h:1679: parse error before `0' /home/db2inst1/sqllib/include/sqlext.h:1789: parse error before `0' /home/db2inst1/sqllib/include/sqlext.h:1812: parse error before `0' /home/db2inst1/sqllib/include/sqlext.h:1838: parse error before `0' /home/db2inst1/sqllib/include/sqlext.h:1856: parse error before `0' /home/db2inst1/sqllib/include/sqlext.h:1873: parse error before `0' /home/db2inst1/sqllib/include/sqlext.h:1882: parse error before `0' /home/db2inst1/sqllib/include/sqlext.h:1893: parse error before `0' /home/db2inst1/sqllib/include/sqlext.h:1908: parse error before `0' /home/db2inst1/sqllib/include/sqlext.h:1918: parse error before `0' In file included from /home/truth/src/php-4.1.2/ext/odbc/php_odbc.h:178, from internal_functions.c:34: /home/db2inst1/sqllib/include/sqlcli1.h:701: parse error before `0' /home/db2inst1/sqllib/include/sqlcli1.h:712: parse error before `0' /home/db2inst1/sqllib/include/sqlcli1.h:785: parse error before `0' /home/db2inst1/sqllib/include/sqlcli1.h:795: parse error before `0' /home/db2inst1/sqllib/include/sqlcli1.h:806: parse error before `0' /home/db2inst1/sqllib/include/sqlcli1.h:1155: parse error before `0' /home/db2inst1/sqllib/include/sqlcli1.h:1165: parse error before `0' /home/db2inst1/sqllib/include/sqlcli1.h:1181: parse error before `0' /home/db2inst1/sqllib/include/sqlcli1.h:1206: parse error before `0' /home/db2inst1/sqllib/include/sqlcli1.h:1248: parse error before `0' /home/db2inst1/sqllib/include/sqlcli1.h:1260: parse error before `0' /home/db2inst1/sqllib/include/sqlcli1.h:1271: parse error before `0' /home/db2inst1/sqllib/include/sqlcli1.h:1304: parse error before `0' make[2]: *** [internal_functions.lo] Error 1 make[2]: Leaving directory `/home/truth/src/php-4.1.2/main' make[1]: *** [all-recursive] Error 1 make[1]: Leaving directory `/home/truth/src/php-4.1.2/main' make: *** [all-recursive] Error 1 ------------------------------------------------------------------------ -- Edit this bug report at http://bugs.php.net/?id=15803&edit=1

« previous php.bugs (#10270) next »