#40410 [NEW]: Posix Compile Error

From: Date: Fri, 09 Feb 2007 03:04:47 +0000
Subject: #40410 [NEW]: Posix Compile Error
Groups: php.bugs 
Request: Send a blank email to php-bugs+get-108603@lists.php.net to get a copy of this message
From: normanmacintyre at aim dot com Operating system: Mac OS X (10.3.9) PHP version: 5.2.1RC4 PHP Bug Type: Compile Failure Bug description: Posix Compile Error Description: ------------ Problem in function posix_getgrgid Actual result: -------------- /www/build/scripts/php-5.2.1/ext/posix/posix.c: In function `zif_posix_getgrgid': /www/build/scripts/php-5.2.1/ext/posix/posix.c:889: error: `_SC_GETGR_R_SIZE_MAX' undeclared (first use in this function) /www/build/scripts/php-5.2.1/ext/posix/posix.c:889: error: (Each undeclared identifier is reported only once /www/build/scripts/php-5.2.1/ext/posix/posix.c:889: error: for each function it appears in.) make: *** [ext/posix/posix.lo] Error 1 -- Edit bug report at http://bugs.php.net/?id=40410&edit=1 -- Try a CVS snapshot (PHP 4.4): http://bugs.php.net/fix.php?id=40410&r=trysnapshot44 Try a CVS snapshot (PHP 5.2): http://bugs.php.net/fix.php?id=40410&r=trysnapshot52 Try a CVS snapshot (PHP 6.0): http://bugs.php.net/fix.php?id=40410&r=trysnapshot60 Fixed in CVS: http://bugs.php.net/fix.php?id=40410&r=fixedcvs Fixed in release: http://bugs.php.net/fix.php?id=40410&r=alreadyfixed Need backtrace: http://bugs.php.net/fix.php?id=40410&r=needtrace Need Reproduce Script: http://bugs.php.net/fix.php?id=40410&r=needscript Try newer version: http://bugs.php.net/fix.php?id=40410&r=oldversion Not developer issue: http://bugs.php.net/fix.php?id=40410&r=support Expected behavior: http://bugs.php.net/fix.php?id=40410&r=notwrong Not enough info: http://bugs.php.net/fix.php?id=40410&r=notenoughinfo Submitted twice: http://bugs.php.net/fix.php?id=40410&r=submittedtwice register_globals: http://bugs.php.net/fix.php?id=40410&r=globals PHP 3 support discontinued: http://bugs.php.net/fix.php?id=40410&r=php3 Daylight Savings: http://bugs.php.net/fix.php?id=40410&r=dst IIS Stability: http://bugs.php.net/fix.php?id=40410&r=isapi Install GNU Sed: http://bugs.php.net/fix.php?id=40410&r=gnused Floating point limitations: http://bugs.php.net/fix.php?id=40410&r=float No Zend Extensions: http://bugs.php.net/fix.php?id=40410&r=nozend MySQL Configuration Error: http://bugs.php.net/fix.php?id=40410&r=mysqlcfg

« previous php.bugs (#108603) next »