#40485 [NEW]: Test cases fail

From: Date: Wed, 14 Feb 2007 20:50:25 +0000
Subject: #40485 [NEW]: Test cases fail
Groups: php.bugs 
Request: Send a blank email to php-bugs+get-108926@lists.php.net to get a copy of this message
From: wdierkes at 5dollarwhitebox dot org Operating system: Rhel3 / Rhel4 PHP version: 4.4.5 PHP Bug Type: Session related Bug description: Test cases fail Description: ------------ The following test cases fail on Rhel3/Rhel4 (i386 and x86_64): bug compatibility: unset($c) with enabled register_globals [ext/session/tests/007.phpt] serializing references test case using globals [ext/session/ tests/019.phpt] Reproduce code: --------------- ./configure, Then make and make test as usual. Actual configure line can be provided if necessary... but should be required. Expected result: ---------------- Test cases should not fail. Actual result: -------------- Test cases fail: ============================================================ ========= TIME END 2007-02-14 13:53:00 ============================================================ ========= TEST RESULT SUMMARY ------------------------------------------------------------ --------- Exts skipped : 56 Exts tested : 30 ------------------------------------------------------------ --------- Number of tests : 626 Tests skipped : 201 (32.1%) Tests warned : 0 (0.0%) Tests failed : 2 (0.3%) Tests passed : 423 (67.6%) ------------------------------------------------------------ --------- Time taken : 60 seconds ============================================================ ========= ============================================================ ========= FAILED TEST SUMMARY ------------------------------------------------------------ --------- bug compatibility: unset($c) with enabled register_globals [ext/session/tests/007.phpt] serializing references test case using globals [ext/session/ tests/019.phpt] ============================================================ ========= >> TEST FAILURE: ../ext/session/tests/007.diff -- 001- float(3.14) 001+ 002- array(1) { 003- ["c"]=> 004- &float(3.14) 005- } 006- float(3.14) 007- array(1) { 008- ["c"]=> 009- &float(3.14) 010- } << ../ext/session/tests/007.diff result ends. >> TEST FAILURE: ../ext/session/tests/019.diff -- 001- array(2) { 001+ 002- ["o1"]=> 003- &object(tfoo)(1) { 004- ["c"]=> 005- int(42) 006- } 007- ["o2"]=> 008- &object(tfoo)(1) { 009- ["c"]=> 010- int(42) 011- } 012- } 013- array(2) { 014- ["o1"]=> 015- &object(tfoo)(1) { 016- ["c"]=> 017- int(44) 018- } 019- ["o2"]=> 020- &object(tfoo)(1) { 021- ["c"]=> 022- int(44) 023- } 024- } << ../ext/session/tests/019.diff result ends. -- Edit bug report at http://bugs.php.net/?id=40485&edit=1 -- Try a CVS snapshot (PHP 4.4): http://bugs.php.net/fix.php?id=40485&r=trysnapshot44 Try a CVS snapshot (PHP 5.2): http://bugs.php.net/fix.php?id=40485&r=trysnapshot52 Try a CVS snapshot (PHP 6.0): http://bugs.php.net/fix.php?id=40485&r=trysnapshot60 Fixed in CVS: http://bugs.php.net/fix.php?id=40485&r=fixedcvs Fixed in release: http://bugs.php.net/fix.php?id=40485&r=alreadyfixed Need backtrace: http://bugs.php.net/fix.php?id=40485&r=needtrace Need Reproduce Script: http://bugs.php.net/fix.php?id=40485&r=needscript Try newer version: http://bugs.php.net/fix.php?id=40485&r=oldversion Not developer issue: http://bugs.php.net/fix.php?id=40485&r=support Expected behavior: http://bugs.php.net/fix.php?id=40485&r=notwrong Not enough info: http://bugs.php.net/fix.php?id=40485&r=notenoughinfo Submitted twice: http://bugs.php.net/fix.php?id=40485&r=submittedtwice register_globals: http://bugs.php.net/fix.php?id=40485&r=globals PHP 3 support discontinued: http://bugs.php.net/fix.php?id=40485&r=php3 Daylight Savings: http://bugs.php.net/fix.php?id=40485&r=dst IIS Stability: http://bugs.php.net/fix.php?id=40485&r=isapi Install GNU Sed: http://bugs.php.net/fix.php?id=40485&r=gnused Floating point limitations: http://bugs.php.net/fix.php?id=40485&r=float No Zend Extensions: http://bugs.php.net/fix.php?id=40485&r=nozend MySQL Configuration Error: http://bugs.php.net/fix.php?id=40485&r=mysqlcfg

« previous php.bugs (#108926) next »