Bug #16365 Updated: make[3]: *** [filestat.lo] Error 1
| From: | sniper@php.net | Date: | Tue, 18 Jun 2002 01:13:04 +0000 |
| Subject: | Bug #16365 Updated: make[3]: *** [filestat.lo] Error 1 | ||
| References: | 1 | Groups: | php.bugs |
| Request: | Send a blank email to php-bugs+get-10997@lists.php.net to get a copy of this message | ||
ID: 16365
Updated by: sniper@php.net
Reported By: andy_a1991@hotmail.com
-Status: Open
+Status: Closed
Bug Type: Compile Failure
Operating System: Linux RedHat v7.2
PHP Version: 4.1.2
New Comment:
Thank you for your bug report. This issue has already been fixed
in the latest released version of PHP, which you can download at
http://www.php.net/downloads.php
Previous Comments:
------------------------------------------------------------------------
[2002-03-30 22:47:48] andy_a1991@hotmail.com
./configure --with-mcrypt=/home/test/.usr
--with-zlib-dir=/home/test/.usr --with-png-dir=/home/test/libpng
--with-gd=../gd-1.8.4 --with-jpeg-dir=/home/test/.usr --with-gettext
--with-config-file-path=/home/test/.usr/etc --enable-track-vars
--enable-force-cgi-redirect --enable-ftp --enable-mbstring
--enable-mbstr-enc-trans
make
gcc -I. -I/home/test/.install/php-4.1.2/ext/standard
-I/home/test/.install/php-4.1.2/main -I/home/test/.install/php-4.1.2
-I/home/test/.install/php-4.1.2/Zend -I/home/test/.usr/include
-I/home/test/.install/gd-1.8.4
-I/home/test/.install/php-4.1.2/ext/mysql/libmysql
-I/home/test/.install/php-4.1.2/ext/xml/expat
-I/home/test/.install/php-4.1.2/TSRM -g -O2 -c filestat.c && touch
filestat.lo
In file included from /usr/include/sys/statfs.h:26,
from filestat.c:49:
/usr/include/statfsbuf.h:25: redefinition of `struct statfs'
make[3]: *** [filestat.lo] Error 1
make[3]: Leaving directory
`/home/test/.install/php-4.1.2/ext/standard'
make[2]: *** [all-recursive] Error 1
make[2]: Leaving directory
`/home/test/.install/php-4.1.2/ext/standard'
make[1]: *** [all-recursive] Error 1
make[1]: Leaving directory `/home/test/.install/php-4.1.2/ext'
make: *** [all-recursive] Error 1
------------------------------------------------------------------------
--
Edit this bug report at http://bugs.php.net/?id=16365&edit=1