Bug #16414 Updated: Unable to compile the fribidi extension
| From: | sniper@php.net | Date: | Tue, 18 Jun 2002 01:36:25 +0000 |
| Subject: | Bug #16414 Updated: Unable to compile the fribidi extension | ||
| References: | 1 | Groups: | php.bugs |
| Request: | Send a blank email to php-bugs+get-11011@lists.php.net to get a copy of this message | ||
ID: 16414
Updated by: sniper@php.net
Reported By: sagi@boom.org.il
-Status: Open
+Status: Feedback
Bug Type: Compile Failure
Operating System: Linux (RedHat 7.2)
PHP Version: 4.1.2
New Comment:
I can't reproduce this..can you please try
this snapshot:
http://snaps.php.net/php4-latest.tar.gz
As I think this was the same problem as the one
with mysql we had..
Previous Comments:
------------------------------------------------------------------------
[2002-04-03 14:49:42] sagi@boom.org.il
Just checked with 4.2.0RC2, the problem still exists.
------------------------------------------------------------------------
[2002-04-03 12:54:13] sagi@boom.org.il
When trying to compile PHP with --with-fribidi:
[sagi@domino php-4.2.0RC1]$ make
Making all in Zend
make[1]: Entering directory `/usr/local/src/php-4.2.0RC1/Zend'
make[1]: Nothing to be done for `all'.
make[1]: Leaving directory `/usr/local/src/php-4.2.0RC1/Zend'
Making all in main
make[1]: Entering directory `/usr/local/src/php-4.2.0RC1/main'
make[2]: Entering directory `/usr/local/src/php-4.2.0RC1/main'
gcc -I. -I/usr/local/src/php-4.2.0RC1/main
-I/usr/local/src/php-4.2.0RC1/main -I/usr/local/src/php-4.2.0RC1
-I/usr/local/src/php-4.2.0RC1/Zend -I/usr/local/include/fribidi/
-I/usr/lib/glib/include/ -I/usr/include/freetype2/freetype
-I/usr/include/mysql -I/usr/include/pspell
-I/usr/local/src/php-4.2.0RC1/ext/xml/expat
-I/usr/local/src/php-4.2.0RC1/TSRM -g -O2 -c internal_functions.c &&
touch internal_functions.lo
In file included from internal_functions.c:36:
/usr/local/src/php-4.2.0RC1/ext/fribidi/php_fribidi.h:32: parse error
before `guint16'
/usr/local/src/php-4.2.0RC1/ext/fribidi/php_fribidi.h:32: warning: no
semicolon at end of struct or union
/usr/local/src/php-4.2.0RC1/ext/fribidi/php_fribidi.h:33: warning: data
definition has no type or storage class
/usr/local/src/php-4.2.0RC1/ext/fribidi/php_fribidi.h:34: parse error
before `*'
/usr/local/src/php-4.2.0RC1/ext/fribidi/php_fribidi.h:34: warning: data
definition has no type or storage class
/usr/local/src/php-4.2.0RC1/ext/fribidi/php_fribidi.h:35: parse error
before `*'
/usr/local/src/php-4.2.0RC1/ext/fribidi/php_fribidi.h:35: warning: data
definition has no type or storage class
/usr/local/src/php-4.2.0RC1/ext/fribidi/php_fribidi.h:36: parse error
before `}'
/usr/local/src/php-4.2.0RC1/ext/fribidi/php_fribidi.h:36: warning: data
definition has no type or storage class
make[2]: *** [internal_functions.lo] Error 1
make[2]: Leaving directory `/usr/local/src/php-4.2.0RC1/main'
make[1]: *** [all-recursive] Error 1
make[1]: Leaving directory `/usr/local/src/php-4.2.0RC1/main'
make: *** [all-recursive] Error 1
[sagi@domino php-4.2.0RC1]$
Same thing happens with PHP4.1.2.
FriBidi version: 0.10.1
GLIB version: 1.2.10
Sagi
------------------------------------------------------------------------
--
Edit this bug report at http://bugs.php.net/?id=16414&edit=1