#41348 [NEW]: Compilation failure with oci8 support
From: clement dot demonchy at bsocom dot com
Operating system: Debian Linux Sarge
PHP version: 5.2.2
PHP Bug Type: Compile Failure
Bug description: Compilation failure with oci8 support
Description:
------------
Hello,
I get a compilation failure when I try to compile php with oci8 support.
The configuration line :
./configure --with-apache=../apache_1.3.37 --with-mysql=/usr/local/mysql
--enable-track-vars --enable-inline-optimization --enable-memory-limit
--enable-ftp --with-zlib-dir=/usr --with-zlib --with-gd --with-png-dir=/usr
--with-jpeg-dir=/usr --with-xml --with-gettext --disable-ipv6 --with-ttf
--with-freetype-dir=/usr --with-xml2 --with-libxml2 --with-dom
--with-dom-xslt --with-pspell --with-openssl
--with-oci8=/home/oracle/product/8.1.7
--with-oracle=/home/oracle/product/8.1.7 --enable-sigchild
--with-oci8-instant-client --with-curl
The error message during make :
/bin/sh /usr/src/php-5.2.2/libtool --silent --preserve-dup-deps
--mode=compile gcc -Iext/oci8/ -I/usr/src/php-5.2.2/ext/oci8/
-DPHP_ATOM_INC -I/usr/src/php-5.2.2/include -I/usr/src/php-5.2.2/main
-I/usr/src/php-5.2.2 -I/usr/include/libxml2
-I/usr/src/php-5.2.2/ext/date/lib -I/usr/include/freetype2
-I/usr/local/mysql/include -I/home/oracle/product/8.1.7/rdbms/public
-I/home/oracle/product/8.1.7/rdbms/demo -I/usr/include/pspell
-I/usr/src/php-5.2.2/TSRM -I/usr/src/php-5.2.2/Zend -I/usr/include -O3
-c /usr/src/php-5.2.2/ext/oci8/oci8_lob.c -o ext/oci8/oci8_lob.lo
/usr/src/php-5.2.2/ext/oci8/oci8_lob.c: In function `php_oci_lob_read':
/usr/src/php-5.2.2/ext/oci8/oci8_lob.c:304: error:
`OCI_NLS_CHARSET_MAXBYTESZ' undeclared (first use in this function)
/usr/src/php-5.2.2/ext/oci8/oci8_lob.c:304: error: (Each undeclared
identifier is reported only once
/usr/src/php-5.2.2/ext/oci8/oci8_lob.c:304: error: for each function it
appears in.)
make: *** [ext/oci8/oci8_lob.lo] Error 1
I'm currently using oracle version 8.1.7.
Best regards.
--
Edit bug report at http://bugs.php.net/?id=41348&edit=1
--
Try a CVS snapshot (PHP 4.4): http://bugs.php.net/fix.php?id=41348&r=trysnapshot44
Try a CVS snapshot (PHP 5.2): http://bugs.php.net/fix.php?id=41348&r=trysnapshot52
Try a CVS snapshot (PHP 6.0): http://bugs.php.net/fix.php?id=41348&r=trysnapshot60
Fixed in CVS: http://bugs.php.net/fix.php?id=41348&r=fixedcvs
Fixed in release: http://bugs.php.net/fix.php?id=41348&r=alreadyfixed
Need backtrace: http://bugs.php.net/fix.php?id=41348&r=needtrace
Need Reproduce Script: http://bugs.php.net/fix.php?id=41348&r=needscript
Try newer version: http://bugs.php.net/fix.php?id=41348&r=oldversion
Not developer issue: http://bugs.php.net/fix.php?id=41348&r=support
Expected behavior: http://bugs.php.net/fix.php?id=41348&r=notwrong
Not enough info: http://bugs.php.net/fix.php?id=41348&r=notenoughinfo
Submitted twice: http://bugs.php.net/fix.php?id=41348&r=submittedtwice
register_globals: http://bugs.php.net/fix.php?id=41348&r=globals
PHP 3 support discontinued: http://bugs.php.net/fix.php?id=41348&r=php3
Daylight Savings: http://bugs.php.net/fix.php?id=41348&r=dst
IIS Stability: http://bugs.php.net/fix.php?id=41348&r=isapi
Install GNU Sed: http://bugs.php.net/fix.php?id=41348&r=gnused
Floating point limitations: http://bugs.php.net/fix.php?id=41348&r=float
No Zend Extensions: http://bugs.php.net/fix.php?id=41348&r=nozend
MySQL Configuration Error: http://bugs.php.net/fix.php?id=41348&r=mysqlcfg
Thread (2 messages)
- clement dot demonchy at bsocom dot com