#41507 [NEW]: Can not compile

From: Date: Sat, 26 May 2007 15:44:15 +0000
Subject: #41507 [NEW]: Can not compile
Groups: php.bugs 
Request: Send a blank email to php-bugs+get-113046@lists.php.net to get a copy of this message
From: vtzan at citiwave dot net Operating system: Linux Centos 4.4 SMP PHP version: 4.4.7 PHP Bug Type: Compile Failure Bug description: Can not compile Description: ------------ this is my php config: --------------------- ./configure --with-apxs=/usr/local/apache/bin/apxs --prefix=/usr/local --with-iconv=/usr it seems something is wrong with iconv in php source. I use the latest version libiconv-1.11. /bin/sh /root/php_install/php-4.4.7/libtool --silent --preserve-dup-deps --mode=compile gcc -I"/usr/include" -Iext/iconv/ -I/root/php_install/php-4.4.7/ext/iconv/ -DPHP_ATOM_INC -I/root/php_install/php-4.4.7/include -I/root/php_install/php-4.4.7/main -I/root/php_install/php-4.4.7 -I/root/php_install/php-4.4.7/ext/xml/expat -I/root/php_install/php-4.4.7/TSRM -I/root/php_install/php-4.4.7/Zend -g -O2 -prefer-non-pic -c /root/php_install/php-4.4.7/ext/iconv/iconv.c -o ext/iconv/iconv.lo /root/php_install/php-4.4.7/ext/iconv/iconv.c: In function `zm_startup_miconv': /root/php_install/php-4.4.7/ext/iconv/iconv.c:124: error: `_libiconv_version' undeclared (first use in this function) /root/php_install/php-4.4.7/ext/iconv/iconv.c:124: error: (Each undeclared identifier is reported only once /root/php_install/php-4.4.7/ext/iconv/iconv.c:124: error: for each function it appears in.) make: *** [ext/iconv/iconv.lo] Error 1 root@golum [~/php_install/php-4.4.7]# thanks for your support. Bill -- Edit bug report at http://bugs.php.net/?id=41507&edit=1 -- Try a CVS snapshot (PHP 4.4): http://bugs.php.net/fix.php?id=41507&r=trysnapshot44 Try a CVS snapshot (PHP 5.2): http://bugs.php.net/fix.php?id=41507&r=trysnapshot52 Try a CVS snapshot (PHP 6.0): http://bugs.php.net/fix.php?id=41507&r=trysnapshot60 Fixed in CVS: http://bugs.php.net/fix.php?id=41507&r=fixedcvs Fixed in release: http://bugs.php.net/fix.php?id=41507&r=alreadyfixed Need backtrace: http://bugs.php.net/fix.php?id=41507&r=needtrace Need Reproduce Script: http://bugs.php.net/fix.php?id=41507&r=needscript Try newer version: http://bugs.php.net/fix.php?id=41507&r=oldversion Not developer issue: http://bugs.php.net/fix.php?id=41507&r=support Expected behavior: http://bugs.php.net/fix.php?id=41507&r=notwrong Not enough info: http://bugs.php.net/fix.php?id=41507&r=notenoughinfo Submitted twice: http://bugs.php.net/fix.php?id=41507&r=submittedtwice register_globals: http://bugs.php.net/fix.php?id=41507&r=globals PHP 3 support discontinued: http://bugs.php.net/fix.php?id=41507&r=php3 Daylight Savings: http://bugs.php.net/fix.php?id=41507&r=dst IIS Stability: http://bugs.php.net/fix.php?id=41507&r=isapi Install GNU Sed: http://bugs.php.net/fix.php?id=41507&r=gnused Floating point limitations: http://bugs.php.net/fix.php?id=41507&r=float No Zend Extensions: http://bugs.php.net/fix.php?id=41507&r=nozend MySQL Configuration Error: http://bugs.php.net/fix.php?id=41507&r=mysqlcfg

« previous php.bugs (#113046) next »