#41689 [NEW]: Compilation failure on HPUX 11.00
| From: | andrey@php.net | Date: | Thu, 14 Jun 2007 14:08:25 +0000 |
| Subject: | #41689 [NEW]: Compilation failure on HPUX 11.00 | ||
| Groups: | php.bugs | ||
| Request: | Send a blank email to php-bugs+get-113784@lists.php.net to get a copy of this message | ||
From: andrey@php.net
Operating system: HPUX 11.00 hppa32
PHP version: 5.2.3
PHP Bug Type: Compile Failure
Bug description: Compilation failure on HPUX 11.00
Description:
------------
/bin/sh /home/mysqldev/php-mysqlnd-32bit/src/php-5.2.3/libtool --silent
--preserve-dup-deps --mode=compile cc -Iext/date/lib -Iext/date/
-I/home/mysqldev/php-mysqlnd-32bit/src/php-5.2.3/ext/date/ -DPHP_ATOM_INC
-I/home/mysqldev/php-mysqlnd-32bit/src/php-5.2.3/include
-I/home/mysqldev/php-mysqlnd-32bit/src/php-5.2.3/main
-I/home/mysqldev/php-mysqlnd-32bit/src/php-5.2.3
-I/home/mysqldev/php-mysqlnd-32bit/src/php-5.2.3/ext/date/lib
-I/home/mysqldev//php-mysqlnd-32bit/inst/mysql-server-gpl/include
-I/home/mysqldev/php-mysqlnd-32bit/src/php-5.2.3/TSRM
-I/home/mysqldev/php-mysqlnd-32bit/src/php-5.2.3/Zend +O2 -g +DAportable
-c /home/mysqldev/php-mysqlnd-32bit/src/php-5.2.3/ext/date/lib/parse_tz.c
-o ext/date/lib/parse_tz.lo
cpp: "/usr/include/limits.h", line 21: warning 2001: Redefinition of macro
LONG_MIN.
-------------------------
/bin/sh /home/mysqldev/php-mysqlnd-32bit/src/php-5.2.3/libtool --silent
--preserve-dup-deps --mode=compile cc -Iregex/
-I/home/mysqldev/php-mysqlnd-32bit/src/php-5.2.3/regex/ -DPHP_ATOM_INC
-I/home/mysqldev/php-mysqlnd-32bit/src/php-5.2.3/include
-I/home/mysqldev/php-mysqlnd-32bit/src/php-5.2.3/main
-I/home/mysqldev/php-mysqlnd-32bit/src/php-5.2.3
-I/home/mysqldev/php-mysqlnd-32bit/src/php-5.2.3/ext/date/lib
-I/home/mysqldev//php-mysqlnd-32bit/inst/mysql-server-gpl/include
-I/home/mysqldev/php-mysqlnd-32bit/src/php-5.2.3/TSRM
-I/home/mysqldev/php-mysqlnd-32bit/src/php-5.2.3/Zend +O2 -g +DAportable
-c /home/mysqldev/php-mysqlnd-32bit/src/php-5.2.3/regex/regcomp.c -o
regex/regcomp.lo
cc: "/home/mysqldev/php-mysqlnd-32bit/src/php-5.2.3/regex/cclass.h", line
7: warning 604: Pointers are not assignment-compatible.
cc: "/home/mysqldev/php-mysqlnd-32bit/src/php-5.2.3/regex/cclass.h", line
7: warning 604: Pointers are not assignment-compatible.
cc: "/home/mysqldev/php-mysqlnd-32bit/src/php-5.2.3/regex/cclass.h", line
7: warning 604: Pointers are not assignment-compatible.
cc: "/home/mysqldev/php-mysqlnd-32bit/src/php-5.2.3/regex/cclass.h", line
8: warning 604: Pointers are not assignment-compatible.
cc: "/home/mysqldev/php-mysqlnd-32bit/src/php-5.2.3/regex/cclass.h", line
8: warning 604: Pointers are not assignment-compatible.
cc: "/home/mysqldev/php-mysqlnd-32bit/src/php-5.2.3/regex/cclass.h", line
9: warning 604: Pointers are not assignment-compatible.
cc: "/home/mysqldev/php-mysqlnd-32bit/src/php-5.2.3/regex/cclass.h", line
10: warning 604: Pointers are not assignment-compatible.
cc: "/home/mysqldev/php-mysqlnd-32bit/src/php-5.2.3/regex/cclass.h", line
10: warning 604: Pointers are not assignment-compatible.
cc: "/home/mysqldev/php-mysqlnd-32bit/src/php-5.2.3/regex/cclass.h", line
10: warning 604: Pointers are not assignment-compatible.
cc: "/home/mysqldev/php-mysqlnd-32bit/src/php-5.2.3/regex/cclass.h", line
11: warning 604: Pointers are not assignment-compatible.
cc: "/home/mysqldev/php-mysqlnd-32bit/src/php-5.2.3/regex/cclass.h", line
11: warning 604: Pointers are not assignment-compatible.
cc: "/home/mysqldev/php-mysqlnd-32bit/src/php-5.2.3/regex/cclass.h", line
11: warning 604: Pointers are not assignment-compatible.
cc: "/home/mysqldev/php-mysqlnd-32bit/src/php-5.2.3/regex/cclass.h", line
13: warning 604: Pointers are not assignment-compatible.
cc: "/home/mysqldev/php-mysqlnd-32bit/src/php-5.2.3/regex/cclass.h", line
13: warning 604: Pointers are not assignment-compatible.
cc: "/home/mysqldev/php-mysqlnd-32bit/src/php-5.2.3/regex/cclass.h", line
13: warning 604: Pointers are not assignment-compatible.
cc: "/home/mysqldev/php-mysqlnd-32bit/src/php-5.2.3/regex/cclass.h", line
14: warning 604: Pointers are not assignment-compatible.
cc: "/home/mysqldev/php-mysqlnd-32bit/src/php-5.2.3/regex/cclass.h", line
14: warning 604: Pointers are not assignment-compatible.
cc: "/home/mysqldev/php-mysqlnd-32bit/src/php-5.2.3/regex/cclass.h", line
16: warning 604: Pointers are not assignment-compatible.
cc: "/home/mysqldev/php-mysqlnd-32bit/src/php-5.2.3/regex/cclass.h", line
17: warning 604: Pointers are not assignment-compatible.
cc: "/home/mysqldev/php-mysqlnd-32bit/src/php-5.2.3/regex/cclass.h", line
17: warning 604: Pointers are not assignment-compatible.
cc: "/home/mysqldev/php-mysqlnd-32bit/src/php-5.2.3/regex/cclass.h", line
18: warning 604: Pointers are not assignment-compatible.
cc: "/home/mysqldev/php-mysqlnd-32bit/src/php-5.2.3/regex/cclass.h", line
19: warning 604: Pointers are not assignment-compatible.
cc: "/home/mysqldev/php-mysqlnd-32bit/src/php-5.2.3/regex/cclass.h", line
19: warning 604: Pointers are not assignment-compatible.
cc: "/home/mysqldev/php-mysqlnd-32bit/src/php-5.2.3/regex/cclass.h", line
21: warning 604: Pointers are not assignment-compatible.
cc: "/home/mysqldev/php-mysqlnd-32bit/src/php-5.2.3/regex/cclass.h", line
22: warning 604: Pointers are not assignment-compatible.
cc: "/home/mysqldev/php-mysqlnd-32bit/src/php-5.2.3/regex/cclass.h", line
22: warning 604: Pointers are not assignment-compatible.
cc: "/home/mysqldev/php-mysqlnd-32bit/src/php-5.2.3/regex/cclass.h", line
23: warning 604: Pointers are not assignment-compatible.
cc: "/home/mysqldev/php-mysqlnd-32bit/src/php-5.2.3/regex/cclass.h", line
24: warning 604: Pointers are not assignment-compatible.
cc: "/home/mysqldev/php-mysqlnd-32bit/src/php-5.2.3/regex/cclass.h", line
24: warning 604: Pointers are not assignment-compatible.
cc: "/home/mysqldev/php-mysqlnd-32bit/src/php-5.2.3/regex/cclass.h", line
24: warning 604: Pointers are not assignment-compatible.
cc: "/home/mysqldev/php-mysqlnd-32bit/src/php-5.2.3/regex/cclass.h", line
25: warning 604: Pointers are not assignment-compatible.
cc: "/home/mysqldev/php-mysqlnd-32bit/src/php-5.2.3/regex/cclass.h", line
25: warning 604: Pointers are not assignment-compatible.
cc: "/home/mysqldev/php-mysqlnd-32bit/src/php-5.2.3/regex/cclass.h", line
26: warning 604: Pointers are not assignment-compatible.
cc: "/home/mysqldev/php-mysqlnd-32bit/src/php-5.2.3/regex/cclass.h", line
27: warning 604: Pointers are not assignment-compatible.
cc: "/home/mysqldev/php-mysqlnd-32bit/src/php-5.2.3/regex/cclass.h", line
27: warning 604: Pointers are not assignment-compatible.
cc: "/home/mysqldev/php-mysqlnd-32bit/src/php-5.2.3/regex/cclass.h", line
28: warning 604: Pointers are not assignment-compatible.
cc: "/home/mysqldev/php-mysqlnd-32bit/src/php-5.2.3/regex/cclass.h", line
29: warning 604: Pointers are not assignment-compatible.
cc: "/home/mysqldev/php-mysqlnd-32bit/src/php-5.2.3/regex/regcomp.c", line
589: warning 604: Pointers are not assignment-compatible.
cc: "/home/mysqldev/php-mysqlnd-32bit/src/php-5.2.3/regex/regcomp.c", line
589: warning 563: Argument #1 is not the correct type.
cc: "/home/mysqldev/php-mysqlnd-32bit/src/php-5.2.3/regex/regcomp.c", line
594: warning 604: Pointers are not assignment-compatible.
cc: "/home/mysqldev/php-mysqlnd-32bit/src/php-5.2.3/regex/regcomp.c", line
594: warning 563: Argument #1 is not the correct type.
cc: "/home/mysqldev/php-mysqlnd-32bit/src/php-5.2.3/regex/regcomp.c", line
736: warning 604: Pointers are not assignment-compatible.
cc: "/home/mysqldev/php-mysqlnd-32bit/src/php-5.2.3/regex/regcomp.c", line
736: warning 563: Argument #1 is not the correct type.
cc: "/home/mysqldev/php-mysqlnd-32bit/src/php-5.2.3/regex/regcomp.c", line
736: warning 604: Pointers are not assignment-compatible.
cc: "/home/mysqldev/php-mysqlnd-32bit/src/php-5.2.3/regex/regcomp.c", line
736: warning 563: Argument #2 is not the correct type.
cc: "/home/mysqldev/php-mysqlnd-32bit/src/php-5.2.3/regex/regcomp.c", line
747: warning 604: Pointers are not assignment-compatible.
cc: "/home/mysqldev/php-mysqlnd-32bit/src/php-5.2.3/regex/regcomp.c", line
747: warning 563: Argument #1 is not the correct type.
cc: "/home/mysqldev/php-mysqlnd-32bit/src/php-5.2.3/regex/regcomp.c", line
809: warning 604: Pointers are not assignment-compatible.
cc: "/home/mysqldev/php-mysqlnd-32bit/src/php-5.2.3/regex/regcomp.c", line
809: warning 563: Argument #2 is not the correct type.
cc: "/home/mysqldev/php-mysqlnd-32bit/src/php-5.2.3/regex/regcomp.c", line
1160: warning 604: Pointers are not assignment-compatible.
cc: "/home/mysqldev/php-mysqlnd-32bit/src/php-5.2.3/regex/regcomp.c", line
1160: warning 563: Argument #1 is not the correct type.
cc: "/home/mysqldev/php-mysqlnd-32bit/src/php-5.2.3/regex/regcomp.c", line
1170: warning 604: Pointers are not assignment-compatible.
cc: "/home/mysqldev/php-mysqlnd-32bit/src/php-5.2.3/regex/regcomp.c", line
1170: warning 563: Argument #1 is not the correct type.
cc: "/home/mysqldev/php-mysqlnd-32bit/src/php-5.2.3/regex/regcomp.c", line
1170: warning 604: Pointers are not assignment-compatible.
cc: "/home/mysqldev/php-mysqlnd-32bit/src/php-5.2.3/regex/regcomp.c", line
1170: warning 563: Argument #2 is not the correct type.
/bin/sh /home/mysqldev/php-mysqlnd-32bit/src/php-5.2.3/libtool --silent
--preserve-dup-deps --mode=compile cc -Iregex/
-I/home/mysqldev/php-mysqlnd-32bit/src/php-5.2.3/regex/ -DPHP_ATOM_INC
-I/home/mysqldev/php-mysqlnd-32bit/src/php-5.2.3/include
-I/home/mysqldev/php-mysqlnd-32bit/src/php-5.2.3/main
-I/home/mysqldev/php-mysqlnd-32bit/src/php-5.2.3
-I/home/mysqldev/php-mysqlnd-32bit/src/php-5.2.3/ext/date/lib
-I/home/mysqldev//php-mysqlnd-32bit/inst/mysql-server-gpl/include
-I/home/mysqldev/php-mysqlnd-32bit/src/php-5.2.3/TSRM
-I/home/mysqldev/php-mysqlnd-32bit/src/php-5.2.3/Zend +O2 -g +DAportable
-c /home/mysqldev/php-mysqlnd-32bit/src/php-5.2.3/regex/regexec.c -o
regex/regexec.lo
cc: "/home/mysqldev/php-mysqlnd-32bit/src/php-5.2.3/regex/engine.c", line
91: warning 604: Pointers are not assignment-compatible.
cc: "/home/mysqldev/php-mysqlnd-32bit/src/php-5.2.3/regex/engine.c", line
91: warning 563: Argument #1 is not the correct type.
cc: "/home/mysqldev/php-mysqlnd-32bit/src/php-5.2.3/regex/engine.c", line
91: warning 604: Pointers are not assignment-compatible.
cc: "/home/mysqldev/php-mysqlnd-32bit/src/php-5.2.3/regex/engine.c", line
91: warning 563: Argument #1 is not the correct type.
/bin/sh /home/mysqldev/php-mysqlnd-32bit/src/php-5.2.3/libtool --silent
--preserve-dup-deps --mode=compile cc -Iregex/
-I/home/mysqldev/php-mysqlnd-32bit/src/php-5.2.3/regex/ -DPHP_ATOM_INC
-I/home/mysqldev/php-mysqlnd-32bit/src/php-5.2.3/include
-I/home/mysqldev/php-mysqlnd-32bit/src/php-5.2.3/main
-I/home/mysqldev/php-mysqlnd-32bit/src/php-5.2.3
-I/home/mysqldev/php-mysqlnd-32bit/src/php-5.2.3/ext/date/lib
-I/home/mysqldev//php-mysqlnd-32bit/inst/mysql-server-gpl/include
-I/home/mysqldev/php-mysqlnd-32bit/src/php-5.2.3/TSRM
-I/home/mysqldev/php-mysqlnd-32bit/src/php-5.2.3/Zend +O2 -g +DAportable
-c /home/mysqldev/php-mysqlnd-32bit/src/php-5.2.3/regex/regerror.c -o
regex/regerror.lo
/bin/sh /home/mysqldev/php-mysqlnd-32bit/src/php-5.2.3/libtool --silent
--preserve-dup-deps --mode=compile cc -Iregex/
-I/home/mysqldev/php-mysqlnd-32bit/src/php-5.2.3/regex/ -DPHP_ATOM_INC
-I/home/mysqldev/php-mysqlnd-32bit/src/php-5.2.3/include
-I/home/mysqldev/php-mysqlnd-32bit/src/php-5.2.3/main
-I/home/mysqldev/php-mysqlnd-32bit/src/php-5.2.3
-I/home/mysqldev/php-mysqlnd-32bit/src/php-5.2.3/ext/date/lib
-I/home/mysqldev//php-mysqlnd-32bit/inst/mysql-server-gpl/include
-I/home/mysqldev/php-mysqlnd-32bit/src/php-5.2.3/TSRM
-I/home/mysqldev/php-mysqlnd-32bit/src/php-5.2.3/Zend +O2 -g +DAportable
-c /home/mysqldev/php-mysqlnd-32bit/src/php-5.2.3/regex/regfree.c -o
regex/regfree.lo
/bin/sh /home/mysqldev/php-mysqlnd-32bit/src/php-5.2.3/libtool --silent
--preserve-dup-deps --mode=compile cc -Iext/standard/
-I/home/mysqldev/php-mysqlnd-32bit/src/php-5.2.3/ext/standard/
-DPHP_ATOM_INC -I/home/mysqldev/php-mysqlnd-32bit/src/php-5.2.3/include
-I/home/mysqldev/php-mysqlnd-32bit/src/php-5.2.3/main
-I/home/mysqldev/php-mysqlnd-32bit/src/php-5.2.3
-I/home/mysqldev/php-mysqlnd-32bit/src/php-5.2.3/ext/date/lib
-I/home/mysqldev//php-mysqlnd-32bit/inst/mysql-server-gpl/include
-I/home/mysqldev/php-mysqlnd-32bit/src/php-5.2.3/TSRM
-I/home/mysqldev/php-mysqlnd-32bit/src/php-5.2.3/Zend +O2 -g +DAportable
-c /home/mysqldev/php-mysqlnd-32bit/src/php-5.2.3/ext/standard/array.c -o
ext/standard/array.lo
cc: "/home/mysqldev/php-mysqlnd-32bit/src/php-5.2.3/ext/standard/array.c",
line 1673: warning 604: Pointers are not assignment-compatible.
cc: "/home/mysqldev/php-mysqlnd-32bit/src/php-5.2.3/ext/standard/array.c",
line 1673: warning 563: Argument #2 is not the correct type.
cc: "/home/mysqldev/php-mysqlnd-32bit/src/php-5.2.3/ext/standard/array.c",
line 1684: warning 604: Pointers are not assignment-compatible.
cc: "/home/mysqldev/php-mysqlnd-32bit/src/php-5.2.3/ext/standard/array.c",
line 1684: warning 563: Argument #2 is not the correct type.
cc: "/home/mysqldev/php-mysqlnd-32bit/src/php-5.2.3/ext/standard/array.c",
line 1690: warning 604: Pointers are not assignment-compatible.
cc: "/home/mysqldev/php-mysqlnd-32bit/src/php-5.2.3/ext/standard/array.c",
line 1690: warning 563: Argument #2 is not the correct type.
cc: "/home/mysqldev/php-mysqlnd-32bit/src/php-5.2.3/ext/standard/array.c",
line 1997: warning 604: Pointers are not assignment-compatible.
cc: "/home/mysqldev/php-mysqlnd-32bit/src/php-5.2.3/ext/standard/array.c",
line 1997: warning 563: Argument #3 is not the correct type.
/bin/sh /home/mysqldev/php-mysqlnd-32bit/src/php-5.2.3/libtool --silent
--preserve-dup-deps --mode=compile cc -Iext/standard/
-I/home/mysqldev/php-mysqlnd-32bit/src/php-5.2.3/ext/standard/
-DPHP_ATOM_INC -I/home/mysqldev/php-mysqlnd-32bit/src/php-5.2.3/include
-I/home/mysqldev/php-mysqlnd-32bit/src/php-5.2.3/main
-I/home/mysqldev/php-mysqlnd-32bit/src/php-5.2.3
-I/home/mysqldev/php-mysqlnd-32bit/src/php-5.2.3/ext/date/lib
-I/home/mysqldev//php-mysqlnd-32bit/inst/mysql-server-gpl/include
-I/home/mysqldev/php-mysqlnd-32bit/src/php-5.2.3/TSRM
-I/home/mysqldev/php-mysqlnd-32bit/src/php-5.2.3/Zend +O2 -g +DAportable
-c /home/mysqldev/php-mysqlnd-32bit/src/php-5.2.3/ext/standard/base64.c -o
ext/standard/base64.lo
cc:
"/home/mysqldev/php-mysqlnd-32bit/src/php-5.2.3/ext/standard/base64.c",
line 217: warning 604: Pointers are not assignment-compatible.
cc:
"/home/mysqldev/php-mysqlnd-32bit/src/php-5.2.3/ext/standard/base64.c",
line 217: warning 563: Argument #1 is not the correct type.
cc:
"/home/mysqldev/php-mysqlnd-32bit/src/php-5.2.3/ext/standard/base64.c",
line 219: warning 604: Pointers are not assignment-compatible.
cc:
"/home/mysqldev/php-mysqlnd-32bit/src/php-5.2.3/ext/standard/base64.c",
line 239: warning 604: Pointers are not assignment-compatible.
cc:
"/home/mysqldev/php-mysqlnd-32bit/src/php-5.2.3/ext/standard/base64.c",
line 239: warning 563: Argument #1 is not the correct type.
cc:
"/home/mysqldev/php-mysqlnd-32bit/src/php-5.2.3/ext/standard/base64.c",
line 241: warning 604: Pointers are not assignment-compatible.
/bin/sh /home/mysqldev/php-mysqlnd-32bit/src/php-5.2.3/libtool --silent
--preserve-dup-deps --mode=compile cc -Iext/standard/
-I/home/mysqldev/php-mysqlnd-32bit/src/php-5.2.3/ext/standard/
-DPHP_ATOM_INC -I/home/mysqldev/php-mysqlnd-32bit/src/php-5.2.3/include
-I/home/mysqldev/php-mysqlnd-32bit/src/php-5.2.3/main
-I/home/mysqldev/php-mysqlnd-32bit/src/php-5.2.3
-I/home/mysqldev/php-mysqlnd-32bit/src/php-5.2.3/ext/date/lib
-I/home/mysqldev//php-mysqlnd-32bit/inst/mysql-server-gpl/include
-I/home/mysqldev/php-mysqlnd-32bit/src/php-5.2.3/TSRM
-I/home/mysqldev/php-mysqlnd-32bit/src/php-5.2.3/Zend +O2 -g +DAportable
-c
/home/mysqldev/php-mysqlnd-32bit/src/php-5.2.3/ext/standard/basic_functions.c
-o ext/standard/basic_functions.lo
cc:
"/home/mysqldev/php-mysqlnd-32bit/src/php-5.2.3/ext/standard/basic_functions.c",
line 5237: warning 562: Redeclaration of "user_shutdown_function_dtor" with
a different storage class specifier: "user_shutdown_function_dtor" will
have internal linkage.
cc:
"/home/mysqldev/php-mysqlnd-32bit/src/php-5.2.3/ext/standard/basic_functions.c",
line 5247: warning 562: Redeclaration of "user_tick_function_dtor" with a
different storage class specifier: "user_tick_function_dtor" will have
internal linkage.
/bin/sh /home/mysqldev/php-mysqlnd-32bit/src/php-5.2.3/libtool --silent
--preserve-dup-deps --mode=compile cc -Iext/standard/
-I/home/mysqldev/php-mysqlnd-32bit/src/php-5.2.3/ext/standard/
-DPHP_ATOM_INC -I/home/mysqldev/php-mysqlnd-32bit/src/php-5.2.3/include
-I/home/mysqldev/php-mysqlnd-32bit/src/php-5.2.3/main
-I/home/mysqldev/php-mysqlnd-32bit/src/php-5.2.3
-I/home/mysqldev/php-mysqlnd-32bit/src/php-5.2.3/ext/date/lib
-I/home/mysqldev//php-mysqlnd-32bit/inst/mysql-server-gpl/include
-I/home/mysqldev/php-mysqlnd-32bit/src/php-5.2.3/TSRM
-I/home/mysqldev/php-mysqlnd-32bit/src/php-5.2.3/Zend +O2 -g +DAportable
-c /home/mysqldev/php-mysqlnd-32bit/src/php-5.2.3/ext/standard/browscap.c
-o ext/standard/browscap.lo
/bin/sh /home/mysqldev/php-mysqlnd-32bit/src/php-5.2.3/libtool --silent
--preserve-dup-deps --mode=compile cc -Iext/standard/
-I/home/mysqldev/php-mysqlnd-32bit/src/php-5.2.3/ext/standard/
-DPHP_ATOM_INC -I/home/mysqldev/php-mysqlnd-32bit/src/php-5.2.3/include
-I/home/mysqldev/php-mysqlnd-32bit/src/php-5.2.3/main
-I/home/mysqldev/php-mysqlnd-32bit/src/php-5.2.3
-I/home/mysqldev/php-mysqlnd-32bit/src/php-5.2.3/ext/date/lib
-I/home/mysqldev//php-mysqlnd-32bit/inst/mysql-server-gpl/include
-I/home/mysqldev/php-mysqlnd-32bit/src/php-5.2.3/TSRM
-I/home/mysqldev/php-mysqlnd-32bit/src/php-5.2.3/Zend +O2 -g +DAportable
-c /home/mysqldev/php-mysqlnd-32bit/src/php-5.2.3/ext/standard/crc32.c -o
ext/standard/crc32.lo
/bin/sh /home/mysqldev/php-mysqlnd-32bit/src/php-5.2.3/libtool --silent
--preserve-dup-deps --mode=compile cc -Iext/standard/
-I/home/mysqldev/php-mysqlnd-32bit/src/php-5.2.3/ext/standard/
-DPHP_ATOM_INC -I/home/mysqldev/php-mysqlnd-32bit/src/php-5.2.3/include
-I/home/mysqldev/php-mysqlnd-32bit/src/php-5.2.3/main
-I/home/mysqldev/php-mysqlnd-32bit/src/php-5.2.3
-I/home/mysqldev/php-mysqlnd-32bit/src/php-5.2.3/ext/date/lib
-I/home/mysqldev//php-mysqlnd-32bit/inst/mysql-server-gpl/include
-I/home/mysqldev/php-mysqlnd-32bit/src/php-5.2.3/TSRM
-I/home/mysqldev/php-mysqlnd-32bit/src/php-5.2.3/Zend +O2 -g +DAportable
-c /home/mysqldev/php-mysqlnd-32bit/src/php-5.2.3/ext/standard/crypt.c -o
ext/standard/crypt.lo
/bin/sh /home/mysqldev/php-mysqlnd-32bit/src/php-5.2.3/libtool --silent
--preserve-dup-deps --mode=compile cc -Iext/standard/
-I/home/mysqldev/php-mysqlnd-32bit/src/php-5.2.3/ext/standard/
-DPHP_ATOM_INC -I/home/mysqldev/php-mysqlnd-32bit/src/php-5.2.3/include
-I/home/mysqldev/php-mysqlnd-32bit/src/php-5.2.3/main
-I/home/mysqldev/php-mysqlnd-32bit/src/php-5.2.3
-I/home/mysqldev/php-mysqlnd-32bit/src/php-5.2.3/ext/date/lib
-I/home/mysqldev//php-mysqlnd-32bit/inst/mysql-server-gpl/include
-I/home/mysqldev/php-mysqlnd-32bit/src/php-5.2.3/TSRM
-I/home/mysqldev/php-mysqlnd-32bit/src/php-5.2.3/Zend +O2 -g +DAportable
-c
/home/mysqldev/php-mysqlnd-32bit/src/php-5.2.3/ext/standard/cyr_convert.c
-o ext/standard/cyr_convert.lo
/bin/sh /home/mysqldev/php-mysqlnd-32bit/src/php-5.2.3/libtool --silent
--preserve-dup-deps --mode=compile cc -Iext/standard/
-I/home/mysqldev/php-mysqlnd-32bit/src/php-5.2.3/ext/standard/
-DPHP_ATOM_INC -I/home/mysqldev/php-mysqlnd-32bit/src/php-5.2.3/include
-I/home/mysqldev/php-mysqlnd-32bit/src/php-5.2.3/main
-I/home/mysqldev/php-mysqlnd-32bit/src/php-5.2.3
-I/home/mysqldev/php-mysqlnd-32bit/src/php-5.2.3/ext/date/lib
-I/home/mysqldev//php-mysqlnd-32bit/inst/mysql-server-gpl/include
-I/home/mysqldev/php-mysqlnd-32bit/src/php-5.2.3/TSRM
-I/home/mysqldev/php-mysqlnd-32bit/src/php-5.2.3/Zend +O2 -g +DAportable
-c /home/mysqldev/php-mysqlnd-32bit/src/php-5.2.3/ext/standard/datetime.c
-o ext/standard/datetime.lo
/bin/sh /home/mysqldev/php-mysqlnd-32bit/src/php-5.2.3/libtool --silent
--preserve-dup-deps --mode=compile cc -Iext/standard/
-I/home/mysqldev/php-mysqlnd-32bit/src/php-5.2.3/ext/standard/
-DPHP_ATOM_INC -I/home/mysqldev/php-mysqlnd-32bit/src/php-5.2.3/include
-I/home/mysqldev/php-mysqlnd-32bit/src/php-5.2.3/main
-I/home/mysqldev/php-mysqlnd-32bit/src/php-5.2.3
-I/home/mysqldev/php-mysqlnd-32bit/src/php-5.2.3/ext/date/lib
-I/home/mysqldev//php-mysqlnd-32bit/inst/mysql-server-gpl/include
-I/home/mysqldev/php-mysqlnd-32bit/src/php-5.2.3/TSRM
-I/home/mysqldev/php-mysqlnd-32bit/src/php-5.2.3/Zend +O2 -g +DAportable
-c /home/mysqldev/php-mysqlnd-32bit/src/php-5.2.3/ext/standard/dir.c -o
ext/standard/dir.lo
cc: "/home/mysqldev/php-mysqlnd-32bit/src/php-5.2.3/ext/standard/dir.c",
line 483: warning 604: Pointers are not assignment-compatible.
cc: "/home/mysqldev/php-mysqlnd-32bit/src/php-5.2.3/ext/standard/dir.c",
line 483: warning 563: Argument #5 is not the correct type.
cc: "/home/mysqldev/php-mysqlnd-32bit/src/php-5.2.3/ext/standard/dir.c",
line 485: warning 604: Pointers are not assignment-compatible.
cc: "/home/mysqldev/php-mysqlnd-32bit/src/php-5.2.3/ext/standard/dir.c",
line 485: warning 563: Argument #5 is not the correct type.
/bin/sh /home/mysqldev/php-mysqlnd-32bit/src/php-5.2.3/libtool --silent
--preserve-dup-deps --mode=compile cc -Iext/standard/
-I/home/mysqldev/php-mysqlnd-32bit/src/php-5.2.3/ext/standard/
-DPHP_ATOM_INC -I/home/mysqldev/php-mysqlnd-32bit/src/php-5.2.3/include
-I/home/mysqldev/php-mysqlnd-32bit/src/php-5.2.3/main
-I/home/mysqldev/php-mysqlnd-32bit/src/php-5.2.3
-I/home/mysqldev/php-mysqlnd-32bit/src/php-5.2.3/ext/date/lib
-I/home/mysqldev//php-mysqlnd-32bit/inst/mysql-server-gpl/include
-I/home/mysqldev/php-mysqlnd-32bit/src/php-5.2.3/TSRM
-I/home/mysqldev/php-mysqlnd-32bit/src/php-5.2.3/Zend +O2 -g +DAportable
-c /home/mysqldev/php-mysqlnd-32bit/src/php-5.2.3/ext/standard/dl.c -o
ext/standard/dl.lo
/bin/sh /home/mysqldev/php-mysqlnd-32bit/src/php-5.2.3/libtool --silent
--preserve-dup-deps --mode=compile cc -Iext/standard/
-I/home/mysqldev/php-mysqlnd-32bit/src/php-5.2.3/ext/standard/
-DPHP_ATOM_INC -I/home/mysqldev/php-mysqlnd-32bit/src/php-5.2.3/include
-I/home/mysqldev/php-mysqlnd-32bit/src/php-5.2.3/main
-I/home/mysqldev/php-mysqlnd-32bit/src/php-5.2.3
-I/home/mysqldev/php-mysqlnd-32bit/src/php-5.2.3/ext/date/lib
-I/home/mysqldev//php-mysqlnd-32bit/inst/mysql-server-gpl/include
-I/home/mysqldev/php-mysqlnd-32bit/src/php-5.2.3/TSRM
-I/home/mysqldev/php-mysqlnd-32bit/src/php-5.2.3/Zend +O2 -g +DAportable
-c /home/mysqldev/php-mysqlnd-32bit/src/php-5.2.3/ext/standard/dns.c -o
ext/standard/dns.lo
cc: "/home/mysqldev/php-mysqlnd-32bit/src/php-5.2.3/ext/standard/dns.c",
line 265: error 1588: "T_MX" undefined.
cc: "/home/mysqldev/php-mysqlnd-32bit/src/php-5.2.3/ext/standard/dns.c",
line 286: error 1588: "T_A" undefined.
cc: "/home/mysqldev/php-mysqlnd-32bit/src/php-5.2.3/ext/standard/dns.c",
line 307: error 1588: "C_IN" undefined.
cc: "/home/mysqldev/php-mysqlnd-32bit/src/php-5.2.3/ext/standard/dns.c",
line 900: error 1000: Unexpected symbol: ")".
cc: "/home/mysqldev/php-mysqlnd-32bit/src/php-5.2.3/ext/standard/dns.c",
line 864: error 1588: "HEADER" undefined.
cc: "/home/mysqldev/php-mysqlnd-32bit/src/php-5.2.3/ext/standard/dns.c",
line 864: error 1588: "hp" undefined.
cc: "/home/mysqldev/php-mysqlnd-32bit/src/php-5.2.3/ext/standard/dns.c",
line 893: error 1588: "C_IN" undefined.
cc: "/home/mysqldev/php-mysqlnd-32bit/src/php-5.2.3/ext/standard/dns.c",
line 901: error 1588: "HFIXEDSZ" undefined.
cc: "/home/mysqldev/php-mysqlnd-32bit/src/php-5.2.3/ext/standard/dns.c",
line 903: error 1532: Reference through a non-pointer.
cc: "/home/mysqldev/php-mysqlnd-32bit/src/php-5.2.3/ext/standard/dns.c",
line 903: error 1527: Incompatible types in cast: Must cast from scalar to
scalar or to void type.
cc: "/home/mysqldev/php-mysqlnd-32bit/src/php-5.2.3/ext/standard/dns.c",
line 903: error 1588: "QFIXEDSZ" undefined.
cc: "/home/mysqldev/php-mysqlnd-32bit/src/php-5.2.3/ext/standard/dns.c",
line 903: error 1603: Incompatible operands: assign operator.
cc: "/home/mysqldev/php-mysqlnd-32bit/src/php-5.2.3/ext/standard/dns.c",
line 908: error 1532: Reference through a non-pointer.
cc: "/home/mysqldev/php-mysqlnd-32bit/src/php-5.2.3/ext/standard/dns.c",
line 908: error 1527: Incompatible types in cast: Must cast from scalar to
scalar or to void type.
gmake: *** [ext/standard/dns.lo] Error 1
Reproduce code:
---------------
Build it
--
Edit bug report at http://bugs.php.net/?id=41689&edit=1
--
Try a CVS snapshot (PHP 4.4): http://bugs.php.net/fix.php?id=41689&r=trysnapshot44
Try a CVS snapshot (PHP 5.2): http://bugs.php.net/fix.php?id=41689&r=trysnapshot52
Try a CVS snapshot (PHP 6.0): http://bugs.php.net/fix.php?id=41689&r=trysnapshot60
Fixed in CVS: http://bugs.php.net/fix.php?id=41689&r=fixedcvs
Fixed in release: http://bugs.php.net/fix.php?id=41689&r=alreadyfixed
Need backtrace: http://bugs.php.net/fix.php?id=41689&r=needtrace
Need Reproduce Script: http://bugs.php.net/fix.php?id=41689&r=needscript
Try newer version: http://bugs.php.net/fix.php?id=41689&r=oldversion
Not developer issue: http://bugs.php.net/fix.php?id=41689&r=support
Expected behavior: http://bugs.php.net/fix.php?id=41689&r=notwrong
Not enough info: http://bugs.php.net/fix.php?id=41689&r=notenoughinfo
Submitted twice: http://bugs.php.net/fix.php?id=41689&r=submittedtwice
register_globals: http://bugs.php.net/fix.php?id=41689&r=globals
PHP 3 support discontinued: http://bugs.php.net/fix.php?id=41689&r=php3
Daylight Savings: http://bugs.php.net/fix.php?id=41689&r=dst
IIS Stability: http://bugs.php.net/fix.php?id=41689&r=isapi
Install GNU Sed: http://bugs.php.net/fix.php?id=41689&r=gnused
Floating point limitations: http://bugs.php.net/fix.php?id=41689&r=float
No Zend Extensions: http://bugs.php.net/fix.php?id=41689&r=nozend
MySQL Configuration Error: http://bugs.php.net/fix.php?id=41689&r=mysqlcfg