Bug #17835: Compile failure with httpd-2.0.39

From: Date: Wed, 19 Jun 2002 13:01:30 +0000
Subject: Bug #17835: Compile failure with httpd-2.0.39
Groups: php.bugs 
Request: Send a blank email to php-bugs+get-11379@lists.php.net to get a copy of this message
From: skamp@skamp.org Operating system: Linux Slackware 8.0 PHP version: 4.2.1 PHP Bug Type: Apache2 related Bug description: Compile failure with httpd-2.0.39 Compile failure of PHP 4.2.1 when building Apache 2 module with httpd-2.0.39 (latest). Configure : --prefix=/opt/php-4.2.1 --with-apxs2=/opt/httpd-2.0.39/bin/apxs --without-mysql --enable-calendar --enable-ftp --enable-ctype --with-curl --with-gd --with-zlib --with-png-dir=/usr/local --with-jpeg-dir=/root/downloads/jpeg-6b --with-freetype-dir=/usr/local/include/freetype --enable-exif Error : Making all in sapi make[1]: Entering directory `/root/downloads/php-4.2.1/sapi' Making all in apache2filter make[2]: Entering directory `/root/downloads/php-4.2.1/sapi/apache2filter' make[3]: Entering directory `/root/downloads/php-4.2.1/sapi/apache2filter' /bin/sh /root/downloads/php-4.2.1/libtool --silent --mode=compile gcc -I. -I/root/downloads/php-4.2.1/sapi/apache2filter -I/root/downloads/pc /bin/sh /root/downloads/php-4.2.1/libtool --silent --mode=compile gcc -I. -I/root/downloads/php-4.2.1/sapi/apache2filter -I/root/downloads/pc /bin/sh /root/downloads/php-4.2.1/libtool --silent --mode=compile gcc -I. -I/root/downloads/php-4.2.1/sapi/apache2filter -I/root/downloads/pc php_functions.c:93: parse error make[3]: *** [php_functions.lo] Error 1 make[3]: Leaving directory `/root/downloads/php-4.2.1/sapi/apache2filter' make[2]: *** [all-recursive] Error 1 make[2]: Leaving directory `/root/downloads/php-4.2.1/sapi/apache2filter' make[1]: *** [all-recursive] Error 1 make[1]: Leaving directory `/root/downloads/php-4.2.1/sapi' make: *** [all-recursive] Error 1 -- Edit bug report at http://bugs.php.net/?id=17835&edit=1 -- Fixed in CVS: http://bugs.php.net/fix.php?id=17835&r=fixedcvs Fixed in release: http://bugs.php.net/fix.php?id=17835&r=alreadyfixed Need backtrace: http://bugs.php.net/fix.php?id=17835&r=needtrace Try newer version: http://bugs.php.net/fix.php?id=17835&r=oldversion Not developer issue: http://bugs.php.net/fix.php?id=17835&r=support Expected behavior: http://bugs.php.net/fix.php?id=17835&r=notwrong Not enough info: http://bugs.php.net/fix.php?id=17835&r=notenoughinfo Submitted twice: http://bugs.php.net/fix.php?id=17835&r=submittedtwice register_globals: http://bugs.php.net/fix.php?id=17835&r=globals

« previous php.bugs (#11379) next »