#41920 [NEW]: make: *** [ext/standard/filestat.lo] Error 1
| From: | jay3ldB at yahoo dot com | Date: | Sun, 08 Jul 2007 05:12:40 +0000 |
| Subject: | #41920 [NEW]: make: *** [ext/standard/filestat.lo] Error 1 | ||
| Groups: | php.bugs | ||
| Request: | Send a blank email to php-bugs+get-114748@lists.php.net to get a copy of this message | ||
From: jay3ldB at yahoo dot com
Operating system: Mac OS X
PHP version: 6CVS-2007-07-08 (snap)
PHP Bug Type: Compile Failure
Bug description: make: *** [ext/standard/filestat.lo] Error 1
Description:
------------
I receive this error while doing "make" on a php6 cvs.
/bin/sh //users/me/downloads/php6.0-200707080030/libtool --silent
--preserve-dup-deps --mode=compile gcc -Iext/standard/
-I//users/me/downloads/php6.0-200707080030/ext/standard/ -DPHP_ATOM_INC
-I//users/me/downloads/php6.0-200707080030/include
-I//users/me/downloads/php6.0-200707080030/main
-I//users/me/downloads/php6.0-200707080030 -I/usr/local/include
-I/usr/local/include/libxml2
-I//users/me/downloads/php6.0-200707080030/pcrelib
-I//users/me/downloads/php6.0-200707080030/ext/date/lib
-I/usr/local/mysql/include -I//users/me/downloads/php6.0-200707080030/TSRM
-I//users/me/downloads/php6.0-200707080030/Zend -no-cpp-precomp
-I/usr/include -g -O2 -c
//users/me/downloads/php6.0-200707080030/ext/standard/filestat.c -o
ext/standard/filestat.lo
//users/me/downloads/php6.0-200707080030/ext/standard/filestat.c: In
function `php_do_chgrp':
//users/me/downloads/php6.0-200707080030/ext/standard/filestat.c:440:
error: `_SC_GETGR_R_SIZE_MAX' undeclared (first use in this function)
//users/me/downloads/php6.0-200707080030/ext/standard/filestat.c:440:
error: (Each undeclared identifier is reported only once
//users/me/downloads/php6.0-200707080030/ext/standard/filestat.c:440:
error: for each function it appears in.)
make: *** [ext/standard/filestat.lo] Error 1
--
Edit bug report at http://bugs.php.net/?id=41920&edit=1
--
Try a CVS snapshot (PHP 4.4): http://bugs.php.net/fix.php?id=41920&r=trysnapshot44
Try a CVS snapshot (PHP 5.2): http://bugs.php.net/fix.php?id=41920&r=trysnapshot52
Try a CVS snapshot (PHP 6.0): http://bugs.php.net/fix.php?id=41920&r=trysnapshot60
Fixed in CVS: http://bugs.php.net/fix.php?id=41920&r=fixedcvs
Fixed in release: http://bugs.php.net/fix.php?id=41920&r=alreadyfixed
Need backtrace: http://bugs.php.net/fix.php?id=41920&r=needtrace
Need Reproduce Script: http://bugs.php.net/fix.php?id=41920&r=needscript
Try newer version: http://bugs.php.net/fix.php?id=41920&r=oldversion
Not developer issue: http://bugs.php.net/fix.php?id=41920&r=support
Expected behavior: http://bugs.php.net/fix.php?id=41920&r=notwrong
Not enough info: http://bugs.php.net/fix.php?id=41920&r=notenoughinfo
Submitted twice: http://bugs.php.net/fix.php?id=41920&r=submittedtwice
register_globals: http://bugs.php.net/fix.php?id=41920&r=globals
PHP 3 support discontinued: http://bugs.php.net/fix.php?id=41920&r=php3
Daylight Savings: http://bugs.php.net/fix.php?id=41920&r=dst
IIS Stability: http://bugs.php.net/fix.php?id=41920&r=isapi
Install GNU Sed: http://bugs.php.net/fix.php?id=41920&r=gnused
Floating point limitations: http://bugs.php.net/fix.php?id=41920&r=float
No Zend Extensions: http://bugs.php.net/fix.php?id=41920&r=nozend
MySQL Configuration Error: http://bugs.php.net/fix.php?id=41920&r=mysqlcfg