#42146 [NEW]: installation fails Not valid internal .phar file (checksum error) in 64 bit
| From: | judas dot iscariote at gmail dot com | Date: | Mon, 30 Jul 2007 14:30:18 +0000 |
| Subject: | #42146 [NEW]: installation fails Not valid internal .phar file (checksum error) in 64 bit | ||
| Groups: | php.bugs | ||
| Request: | Send a blank email to php-bugs+get-115561@lists.php.net to get a copy of this message | ||
From: judas dot iscariote at gmail dot com
Operating system: Only 64 bit linux
PHP version: 5CVS-2007-07-30 (CVS)
PHP Bug Type: *General Issues
Bug description: installation fails Not valid internal .phar file (checksum error) in 64 bit
Description:
------------
During make install ONLY in 64 bit systems, installation aborts with the
following error
Fatal error: Not valid internal .phar file (checksum error) in
/home/cristian/php5/pear/install-pear-nozlib.phar on line 791
make[1]: *** [install-pear-installer] Error 255
make: *** [install-pear] Error 2
Reproduce code:
---------------
make install
Expected result:
----------------
install correctly as it does on 32 bit systems.
Actual result:
--------------
Fatal error: Not valid internal .phar file (checksum error) in
/home/cristian/php5/pear/install-pear-nozlib.phar on line 791
make[1]: *** [install-pear-installer] Error 255
make: *** [install-pear] Error 2
--
Edit bug report at http://bugs.php.net/?id=42146&edit=1
--
Try a CVS snapshot (PHP 4.4): http://bugs.php.net/fix.php?id=42146&r=trysnapshot44
Try a CVS snapshot (PHP 5.2): http://bugs.php.net/fix.php?id=42146&r=trysnapshot52
Try a CVS snapshot (PHP 6.0): http://bugs.php.net/fix.php?id=42146&r=trysnapshot60
Fixed in CVS: http://bugs.php.net/fix.php?id=42146&r=fixedcvs
Fixed in release: http://bugs.php.net/fix.php?id=42146&r=alreadyfixed
Need backtrace: http://bugs.php.net/fix.php?id=42146&r=needtrace
Need Reproduce Script: http://bugs.php.net/fix.php?id=42146&r=needscript
Try newer version: http://bugs.php.net/fix.php?id=42146&r=oldversion
Not developer issue: http://bugs.php.net/fix.php?id=42146&r=support
Expected behavior: http://bugs.php.net/fix.php?id=42146&r=notwrong
Not enough info: http://bugs.php.net/fix.php?id=42146&r=notenoughinfo
Submitted twice: http://bugs.php.net/fix.php?id=42146&r=submittedtwice
register_globals: http://bugs.php.net/fix.php?id=42146&r=globals
PHP 3 support discontinued: http://bugs.php.net/fix.php?id=42146&r=php3
Daylight Savings: http://bugs.php.net/fix.php?id=42146&r=dst
IIS Stability: http://bugs.php.net/fix.php?id=42146&r=isapi
Install GNU Sed: http://bugs.php.net/fix.php?id=42146&r=gnused
Floating point limitations: http://bugs.php.net/fix.php?id=42146&r=float
No Zend Extensions: http://bugs.php.net/fix.php?id=42146&r=nozend
MySQL Configuration Error: http://bugs.php.net/fix.php?id=42146&r=mysqlcfg