#43751 [Com]: unpack test case fails
ID: 43751
Comment by: missingno at ifrance dot com
Reported By: wdierkes at 5dollarwhitebox dot org
Status: Open
Bug Type: Compile Failure
Operating System: Redhat EL 4 i386
PHP Version: 4.4.8
New Comment:
Not really a bug, but the test engine should unset the docref_root &
docref_ext directives in php.ini indeed before proceeding with the
tests.
Previous Comments:
------------------------------------------------------------------------
[2008-01-04 18:08:15] wdierkes at 5dollarwhitebox dot org
Description:
------------
I understand that PHP 4.4.8 was the last release for the 4 branch, so
it isn't likely that any bug reports will catch attention. That said, I
still wanted to report the bug in case others have the same issue.
=====================================================================
FAILED TEST SUMMARY
---------------------------------------------------------------------
Invalid format type validation
[ext/standard/tests/strings/unpack.phpt]
=====================================================================
make: *** [test] Error 1
+ set +x
>> TEST FAILURE: ../ext/standard/tests/strings/unpack.diff --
001- Warning: unpack(): Invalid format type - in %s/unpack.php on line
%d
001+ Warning: unpack() [/phpmanual/function.unpack.html]: Invalid
format type - in
/builddir/build/BUILD/php-4.4.8/ext/standard/tests/strings/unpack.php on
line 2
<< ../ext/standard/tests/strings/unpack.diff result ends.
Reproduce code:
---------------
ext/standard/tests/strings/unpack.phpt
Expected result:
----------------
test case should pass.
Actual result:
--------------
Test case fails.
------------------------------------------------------------------------
--
Edit this bug report at http://bugs.php.net/?id=43751&edit=1
Thread (3 messages)