#46499 [NEW]: gd fails -- didn't fail yesterday
| From: | anthony dot reed at gmail dot com | Date: | Thu, 06 Nov 2008 02:42:34 +0000 |
| Subject: | #46499 [NEW]: gd fails -- didn't fail yesterday | ||
| Groups: | php.bugs | ||
| Request: | Send a blank email to php-bugs+get-130679@lists.php.net to get a copy of this message | ||
From: anthony dot reed at gmail dot com
Operating system: OS X 10.5.5 intel
PHP version: 5.3.0alpha2
PHP Bug Type: Compile Failure
Bug description: gd fails -- didn't fail yesterday
Description:
------------
/Users/tony/src/php/php5.3-200811060130/include/../main/php_config.h:136:1:
warning: this is the location of the previous definition
/Users/tony/src/php/php5.3-200811060130/ext/gd/gd.c: In function
zm_info_gd:
/Users/tony/src/php/php5.3-200811060130/ext/gd/gd.c:1399: error:
JPEG_LIB_VERSION undeclared (first use in this function)
/Users/tony/src/php/php5.3-200811060130/ext/gd/gd.c:1399: error: (Each
undeclared identifier is reported only once
/Users/tony/src/php/php5.3-200811060130/ext/gd/gd.c:1399: error: for each
function it appears in.)
/Users/tony/src/php/php5.3-200811060130/ext/gd/gd.c:1406: error:
PNG_LIBPNG_VER_STRING undeclared (first use in this function)
make: *** [ext/gd/gd.lo] Error 1
--
Edit bug report at http://bugs.php.net/?id=46499&edit=1
--
Try a CVS snapshot (PHP 5.2): http://bugs.php.net/fix.php?id=46499&r=trysnapshot52
Try a CVS snapshot (PHP 5.3): http://bugs.php.net/fix.php?id=46499&r=trysnapshot53
Try a CVS snapshot (PHP 6.0): http://bugs.php.net/fix.php?id=46499&r=trysnapshot60
Fixed in CVS: http://bugs.php.net/fix.php?id=46499&r=fixedcvs
Fixed in CVS and need be documented: http://bugs.php.net/fix.php?id=46499&r=needdocs
Fixed in release: http://bugs.php.net/fix.php?id=46499&r=alreadyfixed
Need backtrace: http://bugs.php.net/fix.php?id=46499&r=needtrace
Need Reproduce Script: http://bugs.php.net/fix.php?id=46499&r=needscript
Try newer version: http://bugs.php.net/fix.php?id=46499&r=oldversion
Not developer issue: http://bugs.php.net/fix.php?id=46499&r=support
Expected behavior: http://bugs.php.net/fix.php?id=46499&r=notwrong
Not enough info: http://bugs.php.net/fix.php?id=46499&r=notenoughinfo
Submitted twice: http://bugs.php.net/fix.php?id=46499&r=submittedtwice
register_globals: http://bugs.php.net/fix.php?id=46499&r=globals
PHP 4 support discontinued: http://bugs.php.net/fix.php?id=46499&r=php4
Daylight Savings: http://bugs.php.net/fix.php?id=46499&r=dst
IIS Stability: http://bugs.php.net/fix.php?id=46499&r=isapi
Install GNU Sed: http://bugs.php.net/fix.php?id=46499&r=gnused
Floating point limitations: http://bugs.php.net/fix.php?id=46499&r=float
No Zend Extensions: http://bugs.php.net/fix.php?id=46499&r=nozend
MySQL Configuration Error: http://bugs.php.net/fix.php?id=46499&r=mysqlcfg