Bug #18220 Updated: Thanks for your reply

From: Date: Mon, 08 Jul 2002 10:07:05 +0000
Subject: Bug #18220 Updated: Thanks for your reply
References: 1  Groups: php.bugs 
Request: Send a blank email to php-bugs+get-13500@lists.php.net to get a copy of this message
ID: 18220 Updated by: long78@intersystek.com Reported By: long78@intersystek.com Status: Bogus Bug Type: Compile Failure Operating System: redhat linux 7.2 PHP Version: 4.2.1 New Comment: i use ./configure --with-mysql=/usr/local/mysql --with-apxs2=/etc/httpd2.0/bin/apxs --enable-track-vars when compiling for apache2. Previous Comments: ------------------------------------------------------------------------ [2002-07-08 06:02:54] long78@intersystek.com this is the infomation of my server: mysql4.0.1---run ok! httpd-2.0.39(./configure --prefix=/etc/httpd2.0 --enable-so --enable-cgi --enable-speling --enable-rewrite --enable-rule=SHARED_CORE --enable-shared=max --enable-module=so)--run ok! resin(./configure --with-apxs=/etc/httpd2.0/bin/apxs)--run ok with apache2.0 php is the last software I want to install thanks ------------------------------------------------------------------------ [2002-07-08 05:41:38] jan@php.net and also try the --with-apxs2 option when compiling for apache2. ------------------------------------------------------------------------ [2002-07-08 05:38:26] derick@php.net Not enough information was provided for us to be able to handle this bug. Please re-read the instructions at http://bugs.php.net/how-to-report.php If you can provide more information, feel free to add it to this bug and change the status back to "Open". Thank you for your interest in PHP. Also, get the latest CVS version of Apache 2 (2.0.40) and PHP. Derick ------------------------------------------------------------------------ [2002-07-08 05:37:24] long78@intersystek.com ./configure --with-mysql=/usr/local/mysql --with-apxs=/etc/httpd2.0/bin/apxs --enable-track-vars ..... make ...... error massages: sapi_apache.c: In function `apache_php_module_main': sapi_apache.c:81: `NOT_FOUND' undeclared (first use in this function) sapi_apache.c:81: (Each undeclared identifier is reported only once sapi_apache.c:81: for each function it appears in.) make[3]: *** [sapi_apache.lo] Error 1 make[3]: Leaving directory `/home/longlwh/php-4.1.2/sapi/apache' make[2]: *** [all-recursive] Error 1 make[2]: Leaving directory `/home/longlwh/php-4.1.2/sapi/apache' make[1]: *** [all-recursive] Error 1 make[1]: Leaving directory `/home/longlwh/php-4.1.2/sapi' make: *** [all-recursive] Error 1 ------------------------------------------------------------------------ -- Edit this bug report at http://bugs.php.net/?id=18220&edit=1

« previous php.bugs (#13500) next »