Bug #15507: Fails to compile with newest Apache 1.3.23!
| From: | djakobse at welho dot com | Date: | Mon, 11 Feb 2002 16:44:46 +0000 |
| Subject: | Bug #15507: Fails to compile with newest Apache 1.3.23! | ||
| Groups: | php.bugs | ||
| Request: | Send a blank email to php-bugs+get-138@lists.php.net to get a copy of this message | ||
From: djakobse@welho.com
Operating system: BeOS R5.0.4
PHP version: 4.1.1
PHP Bug Type: Apache related
Bug description: Fails to compile with newest Apache 1.3.23!
tried compiling newest Apache 1.3.23 with newest php 4.1.1 according to
VERBOSE STATIC module INSTALL instructions from php main dir, but it seems
to be a nogo..
gcc -DBONE -I/boot/develop/php-4.1.1 -I/boot/develop/php-4.1.1/main
-I/boot/develop/php-4.1.1/main -I/boot/develop/php-4.1.1/Zend
-I/boot/develop/php-4.1.1/Zend -I/boot/develop/php-4.1.1/TSRM
-I/boot/develop/php-4.1.1/TSRM -I/boot/develop/php-4.1.1 -DUSE_EXPAT
-I./lib/expat-lite -DNO_DL_NEEDED
./apaci \
-o httpd buildmark.o modules.o modules/standard/libstandard.a
modules/php4/libphp4.a main/libmain.a ./os/unix/libos.a ap/libap.a
lib/expat-lite/libexpat.a -Wl,-rpath,/boot/home/config/lib
-L/boot/home/config/lib -Lmodules/php4 -L../modules/php4
-L../../modules/php4 -lmodphp4 -lpq -lbind -lsocket -lbe -lroot -lbind
-lsocket -lbe -lroot
modules/php4/libphp4.a(fopen_wrappers.o): In function
`php_fopen_with_path':
/boot/develop/php-4.1.1/main/fopen_wrappers.c:411: undefined reference to
`realpath'
/boot/develop/php-4.1.1/main/fopen_wrappers.c:418: undefined reference to
`realpath'
/boot/develop/php-4.1.1/main/fopen_wrappers.c:480: undefined reference to
`realpath'
modules/php4/libphp4.a(safe_mode.o): In function `php_checkuid':
/boot/develop/php-4.1.1/main/fopen_wrappers.c:104: undefined reference to
`realpath'
/boot/develop/php-4.1.1/main/fopen_wrappers.c:128: undefined reference to
`realpath'
collect2: ld returned 1 exit status
make[2]: *** [target_static] Error 1
make[2]: Leaving directory `/boot/develop/apache_1.3.23/src'
make[1]: *** [build-std] Error 2
make[1]: Leaving directory `/boot/develop/apache_1.3.23'
make: *** [build] Error 2
[bebox2:/boot/develop/apache_1.3.23 ]$
--
Edit bug report at http://bugs.php.net/?id=15507&edit=1
--
Fixed in CVS: http://bugs.php.net/fix.php?id=15507&r=fixedcvs
Fixed in release: http://bugs.php.net/fix.php?id=15507&r=alreadyfixed
Need backtrace: http://bugs.php.net/fix.php?id=15507&r=needtrace
Try newer version: http://bugs.php.net/fix.php?id=15507&r=oldversion
Not developer issue: http://bugs.php.net/fix.php?id=15507&r=support
Expected behavior: http://bugs.php.net/fix.php?id=15507&r=notwrong
Not enough info: http://bugs.php.net/fix.php?id=15507&r=notenoughinfo
Submitted twice: http://bugs.php.net/fix.php?id=15507&r=submittedtwice