Bug #15364 Updated: Compile Fails as CGI with INFORMIX on SCO

From: Date: Wed, 24 Jul 2002 05:00:09 +0000
Subject: Bug #15364 Updated: Compile Fails as CGI with INFORMIX on SCO
References: 1  Groups: php.bugs 
Request: Send a blank email to php-bugs+get-14978@lists.php.net to get a copy of this message
ID: 15364 Updated by: php-bugs@lists.php.net Reported By: paul.gardiner@barleychalu.co.uk -Status: Feedback +Status: No Feedback Bug Type: Compile Failure Operating System: SCO Openserver 5.0.4 PHP Version: 4.1.1 New Comment: No feedback was provided for this bug for over a month, so it is being suspended automatically. If you are able to provide the information that was originally requested, please do so and change the status of the bug back to "Open". Previous Comments: ------------------------------------------------------------------------ [2002-06-15 20:41:18] sniper@php.net This snapshot _should_ fix the problem: http://snaps.php.net/php4-latest.tar.gz It works fine for me with the 2.70.UC3 which is the latest I found from the informix site. (Didn't I fix this stuff long time ago?) Please try the snapshot. We have new build system in PHP 4.3.0-dev so.. --Jani ------------------------------------------------------------------------ [2002-02-04 06:23:47] paul.gardiner@barleychalu.co.uk Hi, I can compile PHP 4.1.1 with Apache 1.3.20, Informix 7.2x, zlib, GD, PDFlib. But when trying to compile PHP as just a CGI for non-web use it fails. Using gnu build utils: gcc, gmake etc. configure line used: configure --without-mysql --with-informix I've tried messing about with different combinations of libraries but even if I get it a bit further,sometimes through make, it then fails on make install. I really need to get this to work otherwise I'm ******! If any further info is needed please ask. Regards, - Paul - Error output: *** Warning: Linking the shared library libphp4.la against the *** static library /usr/lib/libgen.a is not portable! /bin/ksh /usr/src/php-4.1.1/libtool --silent --mode=link gcc -I. -I/usr/src/php- 4.1.1/ -I/usr/src/php-4.1.1/main -I/usr/src/php-4.1.1 -I/usr/src/php-4.1.1/Zend -I/usr/informix/incl/esql -I/usr/src/php-4.1.1/ext/xml/expat -I/usr/src/php-4.1 .1/TSRM -g -O2 -o php -export-dynamic stub.lo libphp4.la Undefined first referenced symbol in file getspnam /usr/informix/lib/esql/libifos.so php: fatal error: Symbol referencing errors. No output written to php collect2: ld returned 1 exit status gmake[1]: *** [php] Error 1 gmake[1]: Leaving directory `/usr/src/php-4.1.1' gmake: *** [all-recursive] Error 1 ------------------------------------------------------------------------ -- Edit this bug report at http://bugs.php.net/?id=15364&edit=1

« previous php.bugs (#14978) next »