Bug #18524: gettext compile error while upgrading 4.1.2 to 4.2.2
| From: | alex at ucar dot edu | Date: | Wed, 24 Jul 2002 06:15:21 +0000 |
| Subject: | Bug #18524: gettext compile error while upgrading 4.1.2 to 4.2.2 | ||
| Groups: | php.bugs | ||
| Request: | Send a blank email to php-bugs+get-14984@lists.php.net to get a copy of this message | ||
From: alex@ucar.edu
Operating system: RedHat 7.0
PHP version: 4.2.2
PHP Bug Type: Compile Failure
Bug description: gettext compile error while upgrading 4.1.2 to 4.2.2
Currently running Horde IMP, gettext 0.11.1, PHP 4.1.2 on Apache 1.3.12
Trying to upgrade to PHP 4.2.2 using --with-gettext=/usr/bin/ and getting
the following make error:
###############################
Making all in gettext
make[2]: Entering directory `/usr/local/php-4.2.2/ext/gettext'
make[3]: Entering directory `/usr/local/php-4.2.2/ext/gettext'
/bin/sh /usr/local/php-4.2.2/libtool --silent --mode=compile gcc -I.
-I/usr/local/php-4.2.2/ext/gettext -I/usr/local/php-4.2.2/main
-I/usr/local/php-4.2.2 -I/usr/include/apache -I/usr/local/php-4.2.2/Zend
-I/usr/local/include -I/usr/local/php-4.2.2/ext/mysql/libmysql
-I/usr/local/php-4.2.2/ext/xml/expat -DLINUX=2 -DMOD_SSL=207101 -DEAPI
-DUSE_EXPAT -I/usr/local/php-4.2.2/TSRM -g -O2 -prefer-pic -c gettext.c
gettext.c:210:93: too many arguments for macro "ngettext"
gettext.c:238:115: too many arguments for macro "dngettext"
make[3]: *** [gettext.lo] Error 1
make[3]: Leaving directory `/usr/local/php-4.2.2/ext/gettext'
make[2]: *** [all-recursive] Error 1
make[2]: Leaving directory `/usr/local/php-4.2.2/ext/gettext'
make[1]: *** [all-recursive] Error 1
make[1]: Leaving directory `/usr/local/php-4.2.2/ext'
make: *** [all-recursive] Error 1
###############################
Thanks for the help.
-ac
--
Edit bug report at http://bugs.php.net/?id=18524&edit=1
--
Fixed in CVS: http://bugs.php.net/fix.php?id=18524&r=fixedcvs
Fixed in release: http://bugs.php.net/fix.php?id=18524&r=alreadyfixed
Need backtrace: http://bugs.php.net/fix.php?id=18524&r=needtrace
Try newer version: http://bugs.php.net/fix.php?id=18524&r=oldversion
Not developer issue: http://bugs.php.net/fix.php?id=18524&r=support
Expected behavior: http://bugs.php.net/fix.php?id=18524&r=notwrong
Not enough info: http://bugs.php.net/fix.php?id=18524&r=notenoughinfo
Submitted twice: http://bugs.php.net/fix.php?id=18524&r=submittedtwice
register_globals: http://bugs.php.net/fix.php?id=18524&r=globals