From:
Operating system: RedHat Ent. server 5.4-ppc64
PHP version: 5.3.2
Package: Compile Failure
Bug Type: Bug
Bug description:php-fpm do not support PowerPC processors
Description:
------------
PHP-FPM sapi do not support PowerPC processor.
Build server IBM JS20 bladeserver
[root@headnode ~]# uname -a
Linux headnode.tst.local 2.6.18-194.el5 #1 SMP Tue Mar 16 22:03:12 EDT 2010
ppc64 ppc64 ppc64 GNU/Linux
Test script:
---------------
svn co http://svn.php.net/repository/php/php-src/trunk/sapi/fpm
sapi/fpm
./buildconf --force
./configure --prefix=/opt/php --enable-fpm --build=powerpc-redhat-linux-gnu
--host=powerpc-redhat-linux-gnu --target=ppc-redhat-linux-gnu
make
make install
Expected result:
----------------
Successfull compilation and php-fpm working
Actual result:
--------------
/bin/sh /home/php-5.3.2/libtool --silent --preserve-dup-deps --mode=compile
cc -I/home/php-5.3.2/sapi/fpm -Isapi/fpm/ -I/home/php-5.3.2/sapi/fpm/
-DPHP_ATOM_INC -I/home/php-5.3.2/include -I/home/php-5.3.2/main
-I/home/php-5.3.2 -I/home/php-5.3.2/ext/date/lib
-I/home/php-5.3.2/ext/ereg/regex -I/usr/include/libxml2
-I/home/php-5.3.2/ext/sqlite3/libsqlite -I/home/php-5.3.2/TSRM
-I/home/php-5.3.2/Zend -I/usr/include -g -O2 -fvisibility=hidden -c
/home/php-5.3.2/sapi/fpm/fpm/fastcgi.c -o sapi/fpm/fpm/fastcgi.lo
/bin/sh /home/php-5.3.2/libtool --silent --preserve-dup-deps --mode=compile
cc -I/home/php-5.3.2/sapi/fpm -Isapi/fpm/ -I/home/php-5.3.2/sapi/fpm/
-DPHP_ATOM_INC -I/home/php-5.3.2/include -I/home/php-5.3.2/main
-I/home/php-5.3.2 -I/home/php-5.3.2/ext/date/lib
-I/home/php-5.3.2/ext/ereg/regex -I/usr/include/libxml2
-I/home/php-5.3.2/ext/sqlite3/libsqlite -I/home/php-5.3.2/TSRM
-I/home/php-5.3.2/Zend -I/usr/include -g -O2 -fvisibility=hidden -c
/home/php-5.3.2/sapi/fpm/fpm/fpm.c -o sapi/fpm/fpm/fpm.lo
/bin/sh /home/php-5.3.2/libtool --silent --preserve-dup-deps --mode=compile
cc -I/home/php-5.3.2/sapi/fpm -Isapi/fpm/ -I/home/php-5.3.2/sapi/fpm/
-DPHP_ATOM_INC -I/home/php-5.3.2/include -I/home/php-5.3.2/main
-I/home/php-5.3.2 -I/home/php-5.3.2/ext/date/lib
-I/home/php-5.3.2/ext/ereg/regex -I/usr/include/libxml2
-I/home/php-5.3.2/ext/sqlite3/libsqlite -I/home/php-5.3.2/TSRM
-I/home/php-5.3.2/Zend -I/usr/include -g -O2 -fvisibility=hidden -c
/home/php-5.3.2/sapi/fpm/fpm/fpm_children.c -o
sapi/fpm/fpm/fpm_children.lo
In file included from /home/php-5.3.2/sapi/fpm/fpm/fpm_shm_slots.h:8,
from /home/php-5.3.2/sapi/fpm/fpm/fpm_children.c:28:
/home/php-5.3.2/sapi/fpm/fpm/fpm_atomic.h:124:2: error: #error unsupported
processor. please write a patch and send it to me
In file included from /home/php-5.3.2/sapi/fpm/fpm/fpm_shm_slots.h:8,
from /home/php-5.3.2/sapi/fpm/fpm/fpm_children.c:28:
/home/php-5.3.2/sapi/fpm/fpm/fpm_atomic.h:128: error: expected
Ðââ¤)Ðâ⥠before Ðââ¤*Ðâ⥠token
In file included from /home/php-5.3.2/sapi/fpm/fpm/fpm_children.c:28:
/home/php-5.3.2/sapi/fpm/fpm/fpm_shm_slots.h:16: error: expected
specifier-qualifier-list before Ðââ¤atomic_tÐââ¥
make: *** [sapi/fpm/fpm/fpm_children.lo] Error 1
/bin/sh /home/php-5.3.2/libtool --silent --preserve-dup-deps --mode=compile
cc -I/home/php-5.3.2/sapi/fpm -Isapi/fpm/ -I/home/php-5.3.2/sapi/fpm/
-DPHP_ATOM_INC -I/home/php-5.3.2/include -I/home/php-5.3.2/main
-I/home/php-5.3.2 -I/home/php-5.3.2/ext/date/lib
-I/home/php-5.3.2/ext/ereg/regex -I/usr/include/libxml2
-I/home/php-5.3.2/ext/sqlite3/libsqlite -I/home/php-5.3.2/TSRM
-I/home/php-5.3.2/Zend -I/usr/include -g -O2 -fvisibility=hidden -c
/home/php-5.3.2/sapi/fpm/fpm/fpm_children.c -o
sapi/fpm/fpm/fpm_children.lo
In file included from /home/php-5.3.2/sapi/fpm/fpm/fpm_shm_slots.h:8,
from /home/php-5.3.2/sapi/fpm/fpm/fpm_children.c:28:
/home/php-5.3.2/sapi/fpm/fpm/fpm_atomic.h:124:2: error: #error unsupported
processor. please write a patch and send it to me
In file included from /home/php-5.3.2/sapi/fpm/fpm/fpm_shm_slots.h:8,
from /home/php-5.3.2/sapi/fpm/fpm/fpm_children.c:28:
/home/php-5.3.2/sapi/fpm/fpm/fpm_atomic.h:128: error: expected
Ðââ¤)Ðâ⥠before Ðââ¤*Ðâ⥠token
In file included from /home/php-5.3.2/sapi/fpm/fpm/fpm_children.c:28:
/home/php-5.3.2/sapi/fpm/fpm/fpm_shm_slots.h:16: error: expected
specifier-qualifier-list before Ðââ¤atomic_tÐââ¥
make: *** [sapi/fpm/fpm/fpm_children.lo] Error 1
--
Edit bug report at http://bugs.php.net/bug.php?id=51772&edit=1
--
Try a snapshot (PHP 5.2): http://bugs.php.net/fix.php?id=51772&r=trysnapshot52
Try a snapshot (PHP 5.3): http://bugs.php.net/fix.php?id=51772&r=trysnapshot53
Try a snapshot (PHP 6.0): http://bugs.php.net/fix.php?id=51772&r=trysnapshot60
Fixed in SVN: http://bugs.php.net/fix.php?id=51772&r=fixed
Fixed in SVN and need be documented: http://bugs.php.net/fix.php?id=51772&r=needdocs
Fixed in release: http://bugs.php.net/fix.php?id=51772&r=alreadyfixed
Need backtrace: http://bugs.php.net/fix.php?id=51772&r=needtrace
Need Reproduce Script: http://bugs.php.net/fix.php?id=51772&r=needscript
Try newer version: http://bugs.php.net/fix.php?id=51772&r=oldversion
Not developer issue: http://bugs.php.net/fix.php?id=51772&r=support
Expected behavior: http://bugs.php.net/fix.php?id=51772&r=notwrong
Not enough info: http://bugs.php.net/fix.php?id=51772&r=notenoughinfo
Submitted twice: http://bugs.php.net/fix.php?id=51772&r=submittedtwice
register_globals: http://bugs.php.net/fix.php?id=51772&r=globals
PHP 4 support discontinued: http://bugs.php.net/fix.php?id=51772&r=php4
Daylight Savings: http://bugs.php.net/fix.php?id=51772&r=dst
IIS Stability: http://bugs.php.net/fix.php?id=51772&r=isapi
Install GNU Sed: http://bugs.php.net/fix.php?id=51772&r=gnused
Floating point limitations: http://bugs.php.net/fix.php?id=51772&r=float
No Zend Extensions: http://bugs.php.net/fix.php?id=51772&r=nozend
MySQL Configuration Error: http://bugs.php.net/fix.php?id=51772&r=mysqlcfg