Bug #55111 [Com]: Make fails with --enable-sockets
| From: | carlos dot lazcano at cursor dot cl | Date: | Sun, 10 Jul 2011 20:41:59 +0000 |
| Subject: | Bug #55111 [Com]: Make fails with --enable-sockets | ||
| References: | 1 | Groups: | php.bugs |
| Request: | Send a blank email to php-bugs+get-161762@lists.php.net to get a copy of this message | ||
Edit report at https://bugs.php.net/bug.php?id=55111&edit=1
ID: 55111
Comment by: carlos dot lazcano at cursor dot cl
Reported by: manuel at bouza dot ch
Summary: Make fails with --enable-sockets
Status: Assigned
Type: Bug
Package: Compile Failure
Operating System: Mac OSX 10.6.7
PHP Version: 5.4SVN-2011-07-02 (SVN)
Assigned To: cataphract
Block user comment: N
Private report: N
New Comment:
I get the same error with version php5.4-201107101830
/bin/sh /Users/clazcano/Compilados/php5.4-201107101830/libtool --silent --
preserve-dup-deps --mode=compile cc -Iext/sockets/ -
I/Users/clazcano/Compilados/php5.4-201107101830/ext/sockets/ -DPHP_ATOM_INC -
I/Users/clazcano/Compilados/php5.4-201107101830/include -
I/Users/clazcano/Compilados/php5.4-201107101830/main -
I/Users/clazcano/Compilados/php5.4-201107101830 -
I/Users/clazcano/Compilados/php5.4-201107101830/ext/date/lib -
I/Users/clazcano/Compilados/php5.4-201107101830/ext/ereg/regex -
I/usr/include/libxml2 -I/usr/local/include -I/usr/local/include/freetype2 -
I/Users/clazcano/Compilados/php5.4-201107101830/ext/mbstring/oniguruma -
I/Users/clazcano/Compilados/php5.4-201107101830/ext/mbstring/libmbfl -
I/Users/clazcano/Compilados/php5.4-201107101830/ext/mbstring/libmbfl/mbfl -
I/Users/clazcano/Compilados/php5.4-201107101830/ext/sqlite3/libsqlite -
I/opt/local/include/libxml2 -I/Users/clazcano/Compilados/php5.4-
201107101830/TSRM -I/Users/clazcano/Compilados/php5.4-201107101830/Zend -no-
cpp-precomp -I/usr/local/include -I/usr/local/include -L/usr/local/lib -
fvisibility=hidden -DZTS -DZEND_SIGNALS -c /Users/clazcano/Compilados/php5.4-
201107101830/ext/sockets/multicast.c -o ext/sockets/multicast.lo
/Users/clazcano/Compilados/php5.4-201107101830/ext/sockets/multicast.c: In
function âphp_if_index_to_addr4â:
/Users/clazcano/Compilados/php5.4-201107101830/ext/sockets/multicast.c:426:
error: âstruct ifreqâ has no member named âifr_ifindexâ
/Users/clazcano/Compilados/php5.4-201107101830/ext/sockets/multicast.c: In
function âphp_add4_to_if_indexâ:
/Users/clazcano/Compilados/php5.4-201107101830/ext/sockets/multicast.c:506:
error: âSIOCGIFINDEXâ undeclared (first use in this function)
/Users/clazcano/Compilados/php5.4-201107101830/ext/sockets/multicast.c:506:
error: (Each undeclared identifier is reported only once
/Users/clazcano/Compilados/php5.4-201107101830/ext/sockets/multicast.c:506:
error: for each function it appears in.)
/Users/clazcano/Compilados/php5.4-201107101830/ext/sockets/multicast.c:513:
error: âstruct ifreqâ has no member named âifr_ifindexâ
Previous Comments:
------------------------------------------------------------------------
[2011-07-08 16:00:40] me at sumardi dot net
I have the same issue on Mac OS X.
SVN rev. 313075
------------------------------------------------------------------------
[2011-07-02 12:45:36] manuel at bouza dot ch
Thank you for looking into this. Just tries with svn branches/PHP_5_4, rev
312814 and make now stops with the following error:
/bin/sh /Users/mbouza/tmp/php-5.4-sock/libtool --silent --preserve-dup-deps --
mode=compile cc -Iext/sockets/ -I/Users/mbouza/tmp/php-5.4-sock/ext/sockets/ -
DPHP_ATOM_INC -I/Users/mbouza/tmp/php-5.4-sock/include -I/Users/mbouza/tmp/php-
5.4-sock/main -I/Users/mbouza/tmp/php-5.4-sock -I/Users/mbouza/tmp/php-5.4-
sock/ext/date/lib -I/Users/mbouza/tmp/php-5.4-sock/ext/ereg/regex -
I/usr/include/libxml2 -I/usr/local/include -I/opt/local/include/postgresql90 -
I/Users/mbouza/tmp/php-5.4-sock/ext/sqlite3/libsqlite -I/Users/mbouza/tmp/php-
5.4-sock/TSRM -I/Users/mbouza/tmp/php-5.4-sock/Zend -no-cpp-precomp -
I/usr/local/include -g -O2 -fvisibility=hidden -DZEND_SIGNALS -c
/Users/mbouza/tmp/php-5.4-sock/ext/sockets/sockets.c -o ext/sockets/sockets.lo
/Users/mbouza/tmp/php-5.4-sock/ext/sockets/sockets.c: In function
âzif_socket_connectâ:
/Users/mbouza/tmp/php-5.4-sock/ext/sockets/sockets.c:1556: warning: cast from
pointer to integer of different size
/bin/sh /Users/mbouza/tmp/php-5.4-sock/libtool --silent --preserve-dup-deps --
mode=compile cc -Iext/sockets/ -I/Users/mbouza/tmp/php-5.4-sock/ext/sockets/ -
DPHP_ATOM_INC -I/Users/mbouza/tmp/php-5.4-sock/include -I/Users/mbouza/tmp/php-
5.4-sock/main -I/Users/mbouza/tmp/php-5.4-sock -I/Users/mbouza/tmp/php-5.4-
sock/ext/date/lib -I/Users/mbouza/tmp/php-5.4-sock/ext/ereg/regex -
I/usr/include/libxml2 -I/usr/local/include -I/opt/local/include/postgresql90 -
I/Users/mbouza/tmp/php-5.4-sock/ext/sqlite3/libsqlite -I/Users/mbouza/tmp/php-
5.4-sock/TSRM -I/Users/mbouza/tmp/php-5.4-sock/Zend -no-cpp-precomp -
I/usr/local/include -g -O2 -fvisibility=hidden -DZEND_SIGNALS -c
/Users/mbouza/tmp/php-5.4-sock/ext/sockets/multicast.c -o
ext/sockets/multicast.lo
/Users/mbouza/tmp/php-5.4-sock/ext/sockets/multicast.c: In function
âphp_if_index_to_addr4â:
/Users/mbouza/tmp/php-5.4-sock/ext/sockets/multicast.c:426: error: âstruct
ifreqâ has no member named âifr_ifindexâ
/Users/mbouza/tmp/php-5.4-sock/ext/sockets/multicast.c: In function
âphp_add4_to_if_indexâ:
/Users/mbouza/tmp/php-5.4-sock/ext/sockets/multicast.c:506: error:
âSIOCGIFINDEXâ undeclared (first use in this function)
/Users/mbouza/tmp/php-5.4-sock/ext/sockets/multicast.c:506: error: (Each
undeclared identifier is reported only once
/Users/mbouza/tmp/php-5.4-sock/ext/sockets/multicast.c:506: error: for each
function it appears in.)
/Users/mbouza/tmp/php-5.4-sock/ext/sockets/multicast.c:513: error: âstruct
ifreqâ has no member named âifr_ifindexâ
make: *** [ext/sockets/multicast.lo] Error 1
------------------------------------------------------------------------
[2011-07-02 08:04:14] cataphract@php.net
Committed fix to SVN. Could you try to compile now?
------------------------------------------------------------------------
[2011-07-02 08:03:33] cataphract@php.net
Automatic comment from SVN on behalf of cataphract
Revision: http://svn.php.net/viewvc/?view=revision&revision=312810
Log: - Fixed bug #55111 (sockets extension fails to compile on Mac OSX).
------------------------------------------------------------------------
[2011-07-02 06:12:54] cataphract@php.net
I thought this has been fixed (though I couldn't confirm myself because I don't have Mac
OSX). Assigning to me.
------------------------------------------------------------------------
The remainder of the comments for this report are too long. To view
the rest of the comments, please view the bug report online at
https://bugs.php.net/bug.php?id=55111
--
Edit this bug report at https://bugs.php.net/bug.php?id=55111&edit=1