Bug #59890 [Opn->Csd]: Compile Error when buidling latest on RHEL 5.5
| From: | felipe@php.net | Date: | Mon, 11 Jun 2012 14:04:23 +0000 |
| Subject: | Bug #59890 [Opn->Csd]: Compile Error when buidling latest on RHEL 5.5 | ||
| References: | 1 | Groups: | php.bugs |
| Request: | Send a blank email to php-bugs+get-171197@lists.php.net to get a copy of this message | ||
Edit report at https://bugs.php.net/bug.php?id=59890&edit=1
ID: 59890
Updated by: felipe@php.net
Reported by: diilbert dot atlantis at gmail dot com
Summary: Compile Error when buidling latest on RHEL 5.5
-Status: Open
+Status: Closed
Type: Bug
-Package: sqlite3
+Package: *General Issues
Operating System: RedHat EL 5.5
PHP Version: 5.1.6
-Assigned To:
+Assigned To: felipe
Block user comment: N
Private report: N
New Comment:
Still you having problem with this?
Previous Comments:
------------------------------------------------------------------------
[2011-08-11 13:28:18] diilbert dot atlantis at gmail dot com
Description:
------------
I am building 0.6 (latest) on RHEL 5.5 and the build process is outputting an error.
Reproduce code:
---------------
phpize
./configure
make
Expected result:
----------------
Build to complete.
Actual result:
--------------
/bin/sh /home/rhills/sqlite3-0.6/libtool --mode=compile gcc -I/home/rhills/sqlite3-0.6/libsqlite
-I./libsqlite -DSQLITE_ENABLE_FTS3=1 -DSQLITE_CORE=1 -DSQLITE_THREADSAFE=0 -I.
-I/home/rhills/sqlite3-0.6 -DPHP_ATOM_INC -I/home/rhills/sqlite3-0.6/include
-I/home/rhills/sqlite3-0.6/main -I/home/rhills/sqlite3-0.6 -I/usr/include/php
-I/usr/include/php/main -I/usr/include/php/TSRM -I/usr/include/php/Zend -I/usr/include/php/ext
-DHAVE_CONFIG_H -g -O2 -c /home/rhills/sqlite3-0.6/sqlite3.c -o sqlite3.lo
gcc -I/home/rhills/sqlite3-0.6/libsqlite -I./libsqlite -DSQLITE_ENABLE_FTS3=1 -DSQLITE_CORE=1
-DSQLITE_THREADSAFE=0 -I. -I/home/rhills/sqlite3-0.6 -DPHP_ATOM_INC
-I/home/rhills/sqlite3-0.6/include -I/home/rhills/sqlite3-0.6/main -I/home/rhills/sqlite3-0.6
-I/usr/include/php -I/usr/include/php/main -I/usr/include/php/TSRM -I/usr/include/php/Zend
-I/usr/include/php/ext -DHAVE_CONFIG_H -g -O2 -c /home/rhills/sqlite3-0.6/sqlite3.c -fPIC -DPIC -o
.libs/sqlite3.o
/home/rhills/sqlite3-0.6/sqlite3.c:1944: error: parameter 1 has incomplete type
/home/rhills/sqlite3-0.6/sqlite3.c: In function 'PHP_GINIT_FUNCTION':
/home/rhills/sqlite3-0.6/sqlite3.c:1944: error: parameter name omitted
/home/rhills/sqlite3-0.6/sqlite3.c:1946: error: invalid type argument of 'unary *'
/home/rhills/sqlite3-0.6/sqlite3.c:1946: error: incompatible type for argument 1 of
'memset'
make: *** [sqlite3.lo] Error 1
------------------------------------------------------------------------
--
Edit this bug report at https://bugs.php.net/bug.php?id=59890&edit=1