Bug #64707 [NEW]: gdImageCreateFromJpegPtrEx changes break the build
| From: | sixd@php.net | Date: | Wed, 24 Apr 2013 23:26:03 +0000 |
| Subject: | Bug #64707 [NEW]: gdImageCreateFromJpegPtrEx changes break the build | ||
| Groups: | php.bugs | ||
| Request: | Send a blank email to php-bugs+get-178614@lists.php.net to get a copy of this message | ||
From: sixd
Operating system: Oracle Linux 5.9
PHP version: 5.5Git-2013-04-24 (Git)
Package: GD related
Bug Type: Bug
Bug description:gdImageCreateFromJpegPtrEx changes break the build
Description:
------------
Compiling gd fails in 5.5 & master.
My configure options are:
'--with-gd' \
'--with-curl' \
'--with-jpeg-dir' \
'--with-png-dir' \
'--enable-gd-native-ttf'
The compilation error is:
/home/cjones/php-5.5/ext/gd/libgd/gd_jpeg.c: In function
âphp_gd_gdImageCreateFromJpegPtrâ:
/home/cjones/php-5.5/ext/gd/libgd/gd_jpeg.c:289: warning: implicit
declaration of function âgdImageCreateFromJpegPtrExâ
/home/cjones/php-5.5/ext/gd/libgd/gd_jpeg.c:289: warning: return makes
pointer from integer without a cast
/home/cjones/php-5.5/ext/gd/libgd/gd_jpeg.c: At top level:
/home/cjones/php-5.5/ext/gd/libgd/gd_jpeg.c:293: error: conflicting types
for âgdImageCreateFromJpegPtrExâ
/home/cjones/php-5.5/ext/gd/libgd/gd_jpeg.c:289: error: previous implicit
declaration of âgdImageCreateFromJpegPtrExâ was here
make: *** [ext/gd/libgd/gd_jpeg.lo] Error 1
--
Edit bug report at https://bugs.php.net/bug.php?id=64707&edit=1
--
Try a snapshot (PHP 5.4): https://bugs.php.net/fix.php?id=64707&r=trysnapshot54
Try a snapshot (PHP 5.3): https://bugs.php.net/fix.php?id=64707&r=trysnapshot53
Try a snapshot (trunk): https://bugs.php.net/fix.php?id=64707&r=trysnapshottrunk
Fixed in SVN: https://bugs.php.net/fix.php?id=64707&r=fixed
Fixed in release: https://bugs.php.net/fix.php?id=64707&r=alreadyfixed
Need backtrace: https://bugs.php.net/fix.php?id=64707&r=needtrace
Need Reproduce Script: https://bugs.php.net/fix.php?id=64707&r=needscript
Try newer version: https://bugs.php.net/fix.php?id=64707&r=oldversion
Not developer issue: https://bugs.php.net/fix.php?id=64707&r=support
Expected behavior: https://bugs.php.net/fix.php?id=64707&r=notwrong
Not enough info: https://bugs.php.net/fix.php?id=64707&r=notenoughinfo
Submitted twice: https://bugs.php.net/fix.php?id=64707&r=submittedtwice
register_globals: https://bugs.php.net/fix.php?id=64707&r=globals
PHP 4 support discontinued: https://bugs.php.net/fix.php?id=64707&r=php4
Daylight Savings: https://bugs.php.net/fix.php?id=64707&r=dst
IIS Stability: https://bugs.php.net/fix.php?id=64707&r=isapi
Install GNU Sed: https://bugs.php.net/fix.php?id=64707&r=gnused
Floating point limitations: https://bugs.php.net/fix.php?id=64707&r=float
No Zend Extensions: https://bugs.php.net/fix.php?id=64707&r=nozend
MySQL Configuration Error: https://bugs.php.net/fix.php?id=64707&r=mysqlcfg