Bug #69807 [NEW]: `make install` fail @ "recipe for target 'install-pear-installer' failed"

From: Date: Fri, 12 Jun 2015 02:08:35 +0000
Subject: Bug #69807 [NEW]: `make install` fail @ "recipe for target 'install-pear-installer' failed"
Groups: php.bugs 
Request: Send a blank email to php-bugs+get-193352@lists.php.net to get a copy of this message
From:             robert dot devanna at nospammail dot net
Operating system: linux/64
PHP version:      7.0.0alpha1
Package:          *Compile Issues
Bug Type:         Bug
Bug description:make install fail @ "recipe for target
'install-pear-installer' failed"

Description:
------------
./configure ...
make
	Generating phar.php
	Generating phar.phar
	PEAR package PHP_Archive not installed: generated phar will require
PHP's phar extension be enabled.
	clicommand.inc
	pharcommand.inc
	invertedregexiterator.inc
	directorygraphiterator.inc
	directorytreeiterator.inc
	phar.inc

	Build complete.
	Don't forget to run 'make test'.

make install
	...
	Installing shared extensions:     /usr/local/php7ext/
	Installing PHP CLI binary:        /usr/local/php7/bin/
	Installing PHP CLI man page:      /usr/local/php7/share/man/man1/
	Installing PHP FPM binary:        /usr/local/php7/sbin/
	Installing PHP FPM config:        /usr/local/php7/etc/
	Installing PHP FPM man page:      /usr/local/php7/share/man/man8/
	Installing PHP FPM status page:      /usr/local/php7/share/php/fpm/
	Installing build environment:     /usr/local/php7/lib64/build/
	Installing header files:          /usr/local/php7/include/php/
	Installing helper programs:       /usr/local/php7/bin/
	  program: phpize
	  program: php-config
	Installing man pages:             /usr/local/php7/share/man/man1/
	  page: phpize.1
	  page: php-config.1
	Installing PEAR environment:      /usr/local/php7/share/pear/

	Warning: main(phar://install-pear-nozlib.phar/index.php): failed to
open stream: "PHP_Archive::stream_open" call failed in
/usr/local/src/php7-src/pear/install-pear-nozlib.phar on line 1236

	Warning: Uncaught EngineException: Call to undefined function
ereg_replace() in
/usr/local/src/php7-src/pear/install-pear-nozlib.phar:566
	Stack trace:
	#0 /usr/local/src/php7-src/pear/install-pear-nozlib.phar(729):
PHP_Archive::processFile('phar://install-...')
	#1 /usr/local/src/php7-src/pear/install-pear-nozlib.phar(790):
PHP_Archive->initializeStream('phar://install-...')
	#2 /usr/local/src/php7-src/pear/install-pear-nozlib.phar(777):
PHP_Archive->_streamOpen('phar://install-...')
	#3 /usr/local/src/php7-src/pear/install-pear-nozlib.phar(1236):
PHP_Archive->stream_open('phar://install-...', 'rb', 129, NULL)
	#4 /usr/local/src/php7-src/pear/install-pear-nozlib.phar(1236):
require_once()
	#5 {main}
	  thrown in /usr/local/src/php7-src/pear/install-pear-nozlib.phar on
line 566
	Makefile:482: recipe for target 'install-pear-installer' failed
	make[1]: *** [install-pear-installer] Error 255
	Makefile:485: recipe for target 'install-pear' failed
	make: *** [install-pear] Error 2



-- 
Edit bug report at https://bugs.php.net/bug.php?id=69807&edit=1
-- 
Try a snapshot (PHP 5.4):   https://bugs.php.net/fix.php?id=69807&r=trysnapshot54
Try a snapshot (PHP 5.5):   https://bugs.php.net/fix.php?id=69807&r=trysnapshot55
Try a snapshot (trunk):     https://bugs.php.net/fix.php?id=69807&r=trysnapshottrunk
Fixed in SVN:               https://bugs.php.net/fix.php?id=69807&r=fixed
Fixed in release:           https://bugs.php.net/fix.php?id=69807&r=alreadyfixed
Need backtrace:             https://bugs.php.net/fix.php?id=69807&r=needtrace
Need Reproduce Script:      https://bugs.php.net/fix.php?id=69807&r=needscript
Try newer version:          https://bugs.php.net/fix.php?id=69807&r=oldversion
Not developer issue:        https://bugs.php.net/fix.php?id=69807&r=support
Expected behavior:          https://bugs.php.net/fix.php?id=69807&r=notwrong
Not enough info:            https://bugs.php.net/fix.php?id=69807&r=notenoughinfo
Submitted twice:            https://bugs.php.net/fix.php?id=69807&r=submittedtwice
register_globals:           https://bugs.php.net/fix.php?id=69807&r=globals
PHP 4 support discontinued: https://bugs.php.net/fix.php?id=69807&r=php4
Daylight Savings:           https://bugs.php.net/fix.php?id=69807&r=dst
IIS Stability:              https://bugs.php.net/fix.php?id=69807&r=isapi
Install GNU Sed:            https://bugs.php.net/fix.php?id=69807&r=gnused
Floating point limitations: https://bugs.php.net/fix.php?id=69807&r=float
No Zend Extensions:         https://bugs.php.net/fix.php?id=69807&r=nozend
MySQL Configuration Error:  https://bugs.php.net/fix.php?id=69807&r=mysqlcfg



Thread (3 messages)

« previous php.bugs (#193352) next »