Bug #69896 [NEW]: zend_operators.h:685:2: error: 'asm' operand has impossible constraints
| From: | fh-phpbugs at fholzhauer dot de | Date: | Sun, 21 Jun 2015 13:09:59 +0000 |
| Subject: | Bug #69896 [NEW]: zend_operators.h:685:2: error: 'asm' operand has impossible constraints | ||
| Groups: | php.bugs | ||
| Request: | Send a blank email to php-bugs+get-193736@lists.php.net to get a copy of this message | ||
From: fh-phpbugs at fholzhauer dot de
Operating system: Ubuntu Linux - Trusty 14.04.1
PHP version: 7.0.0alpha1
Package: Compile Failure
Bug Type: Bug
Bug description:zend_operators.h:685:2: error: 'asm' operand has impossible constraints
Description:
------------
I used the same configure statements I currently use to build php5.6 to
give php7 a first try.
While the amd64 version successfully built, the i386 version failed:
In file included from /«PKGBUILDDIR»/Zend/zend.h:338:0,
from /«PKGBUILDDIR»/Zend/zend_execute.c:27:
/«PKGBUILDDIR»/Zend/zend_vm_execute.h: In function
'ZEND_SUB_SPEC_CV_CV_HANDLER':
/«PKGBUILDDIR»/Zend/zend_operators.h:685:2: error: 'asm' operand has
impossible constraints
__asm__(
^
make[1]: *** [Zend/zend_execute.lo] Error 1
Full buildlog:
https://launchpadlibrarian.net/209648281/buildlog_ubuntu-trusty-i386.php7-ies_7.0.0alpha1-0ies1~trustyppa_BUILDING.txt.gz
--
Edit bug report at https://bugs.php.net/bug.php?id=69896&edit=1
--
Try a snapshot (PHP 5.4): https://bugs.php.net/fix.php?id=69896&r=trysnapshot54
Try a snapshot (PHP 5.5): https://bugs.php.net/fix.php?id=69896&r=trysnapshot55
Try a snapshot (trunk): https://bugs.php.net/fix.php?id=69896&r=trysnapshottrunk
Fixed in SVN: https://bugs.php.net/fix.php?id=69896&r=fixed
Fixed in release: https://bugs.php.net/fix.php?id=69896&r=alreadyfixed
Need backtrace: https://bugs.php.net/fix.php?id=69896&r=needtrace
Need Reproduce Script: https://bugs.php.net/fix.php?id=69896&r=needscript
Try newer version: https://bugs.php.net/fix.php?id=69896&r=oldversion
Not developer issue: https://bugs.php.net/fix.php?id=69896&r=support
Expected behavior: https://bugs.php.net/fix.php?id=69896&r=notwrong
Not enough info: https://bugs.php.net/fix.php?id=69896&r=notenoughinfo
Submitted twice: https://bugs.php.net/fix.php?id=69896&r=submittedtwice
register_globals: https://bugs.php.net/fix.php?id=69896&r=globals
PHP 4 support discontinued: https://bugs.php.net/fix.php?id=69896&r=php4
Daylight Savings: https://bugs.php.net/fix.php?id=69896&r=dst
IIS Stability: https://bugs.php.net/fix.php?id=69896&r=isapi
Install GNU Sed: https://bugs.php.net/fix.php?id=69896&r=gnused
Floating point limitations: https://bugs.php.net/fix.php?id=69896&r=float
No Zend Extensions: https://bugs.php.net/fix.php?id=69896&r=nozend
MySQL Configuration Error: https://bugs.php.net/fix.php?id=69896&r=mysqlcfg