#19572 [Opn->Fbk]: Compilation fails with undefined reference to `__log1p'
| From: | sniper@php.net | Date: | Tue, 24 Sep 2002 11:20:47 +0000 |
| Subject: | #19572 [Opn->Fbk]: Compilation fails with undefined reference to `__log1p' | ||
| References: | 1 | Groups: | php.bugs |
| Request: | Send a blank email to php-bugs+get-20186@lists.php.net to get a copy of this message | ||
ID: 19572
Updated by: sniper@php.net
Reported By: pkett@genesis-midi.com
-Status: Open
+Status: Feedback
Bug Type: Compile Failure
Operating System: Linux (Suse 6.1)
PHP Version: 4.2.3
New Comment:
There might be something wrong (or missing) in your system.
Could you try installing GCC 2.95.3 ?
Previous Comments:
------------------------------------------------------------------------
[2002-09-24 04:16:28] pkett@genesis-midi.com
I am attempting to compile PHP under Linux with
egcs-1.1.2.
If I compile php as a DSO module it compiles fine but
apache won't load it complaining of unresolved symbols.
If I try and compile it into apache I get the following
compilation errors :
-o httpd buildmark.o modules.o
modules/standard/libstandard.a modules/proxy/libproxy.a
modules/php4/libphp4.a main/libmain.a ./os/unix/libos.a
ap/libap.a -Wl,-rpath,/usr/local/mysql/lib -rdynamic
-L/usr/local/mysql/lib -Lmodules/php4 -L../modules/php4
-L../../modules/php4 -lmodphp4 -lmysqlclient -lz -lcrypt
-lresolv -lm -ldl -lnsl -lresolv -lcrypt -lm -lcrypt
-lndbm -lexpat
modules/php4/libphp4.a(zend_ini_scanner.lo): warning:
multiple common of `yytext'
modules/php4/libphp4.a(zend_language_scanner.lo): warning:
previous common is here
modules/php4/libphp4.a(math.lo): In function `zif_atanh':
/usr/include/__math.h:426: undefined reference to
`__log1p'
collect2: ld returned 1 exit status
make[2]: *** [target_static] Error 1
make[2]: Leaving directory `/home/pkett/apache_1.3.26/src'
make[1]: *** [build-std] Error 2
make[1]: Leaving directory `/home/pkett/apache_1.3.26'
make: *** [build] Error 2
I have tried with 4.2.2 and 4.2.3 with the same results -
I suspect it's due to using egcs and not a more recent
version of gcc but can anyone confirm this?
------------------------------------------------------------------------
--
Edit this bug report at http://bugs.php.net/?id=19572&edit=1