Bug #58511 [Opn->Fbk]: can't find 'phpext_sqlite3_ptr' in internal_functions.c

From: Date: Mon, 27 Jun 2016 13:43:30 +0000
Subject: Bug #58511 [Opn->Fbk]: can't find 'phpext_sqlite3_ptr' in internal_functions.c
References: 1  Groups: php.bugs 
Request: Send a blank email to php-bugs+get-201867@lists.php.net to get a copy of this message
Edit report at https://bugs.php.net/bug.php?id=58511&edit=1 ID: 58511 Updated by: cmb@php.net Reported by: sprbeyond at sohu dot com Summary: can't find 'phpext_sqlite3_ptr' in internal_functions.c -Status: Open +Status: Feedback Type: Bug -Package: sqlite3 +Package: SQLite related Operating System: linux PHP Version: 5_2 CVS-2009-01-18 (dev) -Assigned To: +Assigned To: cmb Block user comment: N Private report: N New Comment: The SQLite3 documentation states[1]: | This extension was briefly a PECL extension but that version is | only recommended for experimental use. Apparently, it would be good to mark the extension as such on PECL, but that would be something for another ticket. The relevant question here is: does that issue still persist for recent versions of the bundled SQLite3 extension? [1] <http://php.net/manual/en/sqlite3.installation.php> Previous Comments: ------------------------------------------------------------------------ [2009-04-30 05:06:11] dams@php.net Another note : I got also a compile error with PHP 5.3, when I compiled it with some other extension (list is too long). When compiled with PHP 5.3 as the only extra extension, it works fine. I'll try to get the conflicting extension. ------------------------------------------------------------------------ [2009-04-30 03:39:21] dams@php.net I get the same error when compiling on Mac OS X 10.5.6 : main/internal_functions.c:63: error: 'phpext_sqlite3_ptr' undeclared here (not in a function) make: *** [main/internal_functions.lo] Error 1 ------------------------------------------------------------------------ [2009-01-18 06:35:40] sprbeyond at sohu dot com Description: ------------ Installing sqlite3-0-6.tgz in PHP v2.5.8 main/internal_functions.c:63: error: 'phpext_sqlite3_ptr' undeclared here (not in a function) ------------------------------------------------------------------------ -- Edit this bug report at https://bugs.php.net/bug.php?id=58511&edit=1

« previous php.bugs (#201867) next »