#19616 [Bgs]: cant config! did everything that README sayd. use it wit apache 2.0.39

From: Date: Thu, 26 Sep 2002 15:13:19 +0000
Subject: #19616 [Bgs]: cant config! did everything that README sayd. use it wit apache 2.0.39
References: 1  Groups: php.bugs 
Request: Send a blank email to php-bugs+get-20414@lists.php.net to get a copy of this message
ID: 19616 Updated by: hholzgra@php.net Reported By: kolesar_m@yahoo.se Status: Bogus -Bug Type: Apache2 related +Bug Type: *Configuration Issues Operating System: slackware 8.0 PHP Version: 4.2.3 New Comment: Not enough information was provided for us to be able to handle this bug. Please re-read the instructions at http://bugs.php.net/how-to-report.php If you can provide more information, feel free to add it to this bug and change the status back to "Open". Thank you for your interest in PHP. afaik it is rather clearly mentioned that it needs 2.0.40? Previous Comments: ------------------------------------------------------------------------ [2002-09-26 10:11:22] sniper@php.net Get newer Apache2. ------------------------------------------------------------------------ [2002-09-26 10:10:28] kolesar_m@yahoo.se it tryed to conf it whit apache 2.0.39 :( no luck ------------------------------------------------------------------------ [2002-09-26 10:09:14] kolesar_m@yahoo.se sapi_apache2.c: In function `php_register_hook': sapi_apache2.c:567: incompatible type for argument 3 of `ap_register_output_filter' sapi_apache2.c:567: too many arguments to function `ap_register_output_filter' sapi_apache2.c:568: incompatible type for argument 3 of `ap_register_input_filter' sapi_apache2.c:568: too many arguments to function `ap_register_input_filter' make[3]: *** [sapi_apache2.lo] Error 1 make[3]: Leaving directory `/home/cyberz/php-4.2.3/sapi/apache2filter' make[2]: *** [install-recursive] Error 1 make[2]: Leaving directory `/home/cyberz/php-4.2.3/sapi/apache2filter' make[1]: *** [install-recursive] Error 1 make[1]: Leaving directory `/home/cyberz/php-4.2.3/sapi' make: *** [install-recursive] Error 1 ------------------------------------------------------------------------ -- Edit this bug report at http://bugs.php.net/?id=19616&edit=1

« previous php.bugs (#20414) next »