Bug #75105 [NEW]: zend_ini_parser.y:294: error: syntax error before '(' token
From: 813577991 at qq dot com
Operating system: linux
PHP version: 7.1.8
Package: Compile Failure
Bug Type: Bug
Bug description:zend_ini_parser.y:294: error: syntax error before '(' token
Description:
------------
when I compile, following errors stoped the process:
/bin/sh /root/php-7.1.8/libtool --silent --preserve-dup-deps
--mode=compile cc -DZEND_ENABLE_STATIC_TSRMLS_CACHE=1 -IZend/
-I/root/php-7.1.8/Zend/ -DPHP_ATOM_INC -I/root/php-7.1.8/include
-I/root/php-7.1.8/main -I/root/php-7.1.8 -I/root/php-7.1.8/ext/date/lib
-I/usr/include/libxml2 -I/root/php-7.1.8/ext/sqlite3/libsqlite
-I/root/php-7.1.8/TSRM -I/root/php-7.1.8/Zend -I/usr/include -g -O2
-DZEND_SIGNALS -c /root/php-7.1.8/Zend/zend_ini_parser.c -o
Zend/zend_ini_parser.lo
/root/php-7.1.8/Zend/zend_ini_parser.y: In function `yydestruct':
/root/php-7.1.8/Zend/zend_ini_parser.y:294: error: syntax error before
'(' token
/root/php-7.1.8/Zend/zend_ini_parser.y:294: error: syntax error before
'(' token
/root/php-7.1.8/Zend/zend_ini_parser.y:294: error: syntax error before
'(' token
/root/php-7.1.8/Zend/zend_ini_parser.y:294: error: syntax error before
'(' token
/root/php-7.1.8/Zend/zend_ini_parser.y:294: error: syntax error before
'(' token
/root/php-7.1.8/Zend/zend_ini_parser.y:294: error: syntax error before
'(' token
/root/php-7.1.8/Zend/zend_ini_parser.y:294: error: syntax error before
'(' token
/root/php-7.1.8/Zend/zend_ini_parser.y:294: error: syntax error before
'(' token
/root/php-7.1.8/Zend/zend_ini_parser.y:294: error: syntax error before
'(' token
/root/php-7.1.8/Zend/zend_ini_parser.y:294: error: syntax error before
'(' token
/root/php-7.1.8/Zend/zend_ini_parser.y:294: error: syntax error before
'(' token
make: *** [Zend/zend_ini_parser.lo] Error 1
--
Edit bug report at https://bugs.php.net/bug.php?id=75105&edit=1
--
Try a snapshot (PHP 5.4): https://bugs.php.net/fix.php?id=75105&r=trysnapshot54
Try a snapshot (PHP 5.5): https://bugs.php.net/fix.php?id=75105&r=trysnapshot55
Try a snapshot (trunk): https://bugs.php.net/fix.php?id=75105&r=trysnapshottrunk
Fixed in SVN: https://bugs.php.net/fix.php?id=75105&r=fixed
Fixed in release: https://bugs.php.net/fix.php?id=75105&r=alreadyfixed
Need backtrace: https://bugs.php.net/fix.php?id=75105&r=needtrace
Need Reproduce Script: https://bugs.php.net/fix.php?id=75105&r=needscript
Try newer version: https://bugs.php.net/fix.php?id=75105&r=oldversion
Not developer issue: https://bugs.php.net/fix.php?id=75105&r=support
Expected behavior: https://bugs.php.net/fix.php?id=75105&r=notwrong
Not enough info: https://bugs.php.net/fix.php?id=75105&r=notenoughinfo
Submitted twice: https://bugs.php.net/fix.php?id=75105&r=submittedtwice
register_globals: https://bugs.php.net/fix.php?id=75105&r=globals
PHP 4 support discontinued: https://bugs.php.net/fix.php?id=75105&r=php4
Daylight Savings: https://bugs.php.net/fix.php?id=75105&r=dst
IIS Stability: https://bugs.php.net/fix.php?id=75105&r=isapi
Install GNU Sed: https://bugs.php.net/fix.php?id=75105&r=gnused
Floating point limitations: https://bugs.php.net/fix.php?id=75105&r=float
No Zend Extensions: https://bugs.php.net/fix.php?id=75105&r=nozend
MySQL Configuration Error: https://bugs.php.net/fix.php?id=75105&r=mysqlcfg
Thread (6 messages)
- 813577991 at qq dot com