Req #78899 [NEW]: gcc6.5

From: Date: Mon, 02 Dec 2019 13:03:22 +0000
Subject: Req #78899 [NEW]: gcc6.5
Groups: php.bugs 
Request: Send a blank email to php-bugs+get-224012@lists.php.net to get a copy of this message
From: 269952181 at qq dot com Operating system: centos6.9 PHP version: 7.4.0 Package: Compile Failure Bug Type: Feature/Change Request Bug description:gcc6.5 Description: ------------ ll -Wno-strict-aliasing -DZEND_SIGNALS -c /base/pub/source/php-7.4.0/ext/standard/php_crypt_r.c -o ext/standard/php_crypt_r.lo /bin/sh /base/pub/source/php-7.4.0/libtool --silent --preserve-dup-deps --mode=compile cc -DZEND_ENABLE_STATIC_TSRMLS_CACHE=1 -Iext/standard/ -I/base/pub/source/php-7.4.0/ext/standard/ -DPHP_ATOM_INC -I/base/pub/source/php-7.4.0/include -I/base/pub/source/php-7.4.0/main -I/base/pub/source/php-7.4.0 -I/base/pub/source/php-7.4.0/ext/date/lib -I/usr/include/libxml2 -I/usr/local/sqlite/include -I/base/pub/source/php-7.4.0/TSRM -I/base/pub/source/php-7.4.0/Zend -I/usr/include -g -O2 -fvisibility=hidden -Wall -Wno-strict-aliasing -DZEND_SIGNALS -c /base/pub/source/php-7.4.0/ext/standard/array.c -o ext/standard/array.lo /bin/sh /base/pub/source/php-7.4.0/libtool --silent --preserve-dup-deps --mode=compile cc -DZEND_ENABLE_STATIC_TSRMLS_CACHE=1 -Iext/standard/ -I/base/pub/source/php-7.4.0/ext/standard/ -DPHP_ATOM_INC -I/base/pub/source/php-7.4.0/include -I/base/pub/source/php-7.4.0/main -I/base/pub/source/php-7.4.0 -I/base/pub/source/php-7.4.0/ext/date/lib -I/usr/include/libxml2 -I/usr/local/sqlite/include -I/base/pub/source/php-7.4.0/TSRM -I/base/pub/source/php-7.4.0/Zend -I/usr/include -g -O2 -fvisibility=hidden -Wall -Wno-strict-aliasing -DZEND_SIGNALS -c /base/pub/source/php-7.4.0/ext/standard/base64.c -o ext/standard/base64.lo /tmp/ccxEFnVX.s: Assembler messages: /tmp/ccxEFnVX.s:526: Error: no such instruction: `vpermd (%rbx),%ymm1,%ymm1' /tmp/ccxEFnVX.s:557: Error: suffix or operands invalid for `vpshufb' /tmp/ccxEFnVX.s:576: Error: suffix or operands invalid for `vpand' /tmp/ccxEFnVX.s:582: Error: suffix or operands invalid for `vpmulhuw' /tmp/ccxEFnVX.s:588: Error: suffix or operands invalid for `vpand' /tmp/ccxEFnVX.s:594: Error: suffix or operands invalid for `vpmullw' /tmp/ccxEFnVX.s:600: Error: suffix or operands invalid for `vpor' /tmp/ccxEFnVX.s:610: Error: suffix or operands invalid for `vpcmpgtb' /tmp/ccxEFnVX.s:616: Error: suffix or operands invalid for `vpsubusb' /tmp/ccxEFnVX.s:622: Error: suffix or operands invalid for `vpsubb' /tmp/ccxEFnVX.s:628: Error: suffix or operands invalid for `vpshufb' /tmp/ccxEFnVX.s:634: Error: suffix or operands invalid for `vpaddb' /tmp/ccxEFnVX.s:1190: Error: suffix or operands invalid for `vpcmpeqb' /tmp/ccxEFnVX.s:1210: Error: suffix or operands invalid for `vpaddb' /tmp/ccxEFnVX.s:1216: Error: suffix or operands invalid for `vpshufb' /tmp/ccxEFnVX.s:1223: Error: suffix or operands invalid for `vpaddb' /tmp/ccxEFnVX.s:1232: Error: suffix or operands invalid for `vpmaddubsw' /tmp/ccxEFnVX.s:1239: Error: suffix or operands invalid for `vpmaddwd' /tmp/ccxEFnVX.s:1245: Error: suffix or operands invalid for `vpshufb' /tmp/ccxEFnVX.s:1251: Error: no such instruction: `vpermd %ymm0,%ymm7,%ymm0' /tmp/ccxEFnVX.s:1282: Error: suffix or operands invalid for `vpsrld' /tmp/ccxEFnVX.s:1289: Error: suffix or operands invalid for `vpand' /tmp/ccxEFnVX.s:1294: Error: suffix or operands invalid for `vpand' /tmp/ccxEFnVX.s:1300: Error: suffix or operands invalid for `vpshufb' /tmp/ccxEFnVX.s:1305: Error: suffix or operands invalid for `vpshufb' make: *** [ext/standard/base64.lo] Error 1 Test script: --------------- ll -Wno-strict-aliasing -DZEND_SIGNALS -c /base/pub/source/php-7.4.0/ext/standard/php_crypt_r.c -o ext/standard/php_crypt_r.lo /bin/sh /base/pub/source/php-7.4.0/libtool --silent --preserve-dup-deps --mode=compile cc -DZEND_ENABLE_STATIC_TSRMLS_CACHE=1 -Iext/standard/ -I/base/pub/source/php-7.4.0/ext/standard/ -DPHP_ATOM_INC -I/base/pub/source/php-7.4.0/include -I/base/pub/source/php-7.4.0/main -I/base/pub/source/php-7.4.0 -I/base/pub/source/php-7.4.0/ext/date/lib -I/usr/include/libxml2 -I/usr/local/sqlite/include -I/base/pub/source/php-7.4.0/TSRM -I/base/pub/source/php-7.4.0/Zend -I/usr/include -g -O2 -fvisibility=hidden -Wall -Wno-strict-aliasing -DZEND_SIGNALS -c /base/pub/source/php-7.4.0/ext/standard/array.c -o ext/standard/array.lo /bin/sh /base/pub/source/php-7.4.0/libtool --silent --preserve-dup-deps --mode=compile cc -DZEND_ENABLE_STATIC_TSRMLS_CACHE=1 -Iext/standard/ -I/base/pub/source/php-7.4.0/ext/standard/ -DPHP_ATOM_INC -I/base/pub/source/php-7.4.0/include -I/base/pub/source/php-7.4.0/main -I/base/pub/source/php-7.4.0 -I/base/pub/source/php-7.4.0/ext/date/lib -I/usr/include/libxml2 -I/usr/local/sqlite/include -I/base/pub/source/php-7.4.0/TSRM -I/base/pub/source/php-7.4.0/Zend -I/usr/include -g -O2 -fvisibility=hidden -Wall -Wno-strict-aliasing -DZEND_SIGNALS -c /base/pub/source/php-7.4.0/ext/standard/base64.c -o ext/standard/base64.lo /tmp/ccxEFnVX.s: Assembler messages: /tmp/ccxEFnVX.s:526: Error: no such instruction: `vpermd (%rbx),%ymm1,%ymm1' /tmp/ccxEFnVX.s:557: Error: suffix or operands invalid for `vpshufb' /tmp/ccxEFnVX.s:576: Error: suffix or operands invalid for `vpand' /tmp/ccxEFnVX.s:582: Error: suffix or operands invalid for `vpmulhuw' /tmp/ccxEFnVX.s:588: Error: suffix or operands invalid for `vpand' /tmp/ccxEFnVX.s:594: Error: suffix or operands invalid for `vpmullw' /tmp/ccxEFnVX.s:600: Error: suffix or operands invalid for `vpor' /tmp/ccxEFnVX.s:610: Error: suffix or operands invalid for `vpcmpgtb' /tmp/ccxEFnVX.s:616: Error: suffix or operands invalid for `vpsubusb' /tmp/ccxEFnVX.s:622: Error: suffix or operands invalid for `vpsubb' /tmp/ccxEFnVX.s:628: Error: suffix or operands invalid for `vpshufb' /tmp/ccxEFnVX.s:634: Error: suffix or operands invalid for `vpaddb' /tmp/ccxEFnVX.s:1190: Error: suffix or operands invalid for `vpcmpeqb' /tmp/ccxEFnVX.s:1210: Error: suffix or operands invalid for `vpaddb' /tmp/ccxEFnVX.s:1216: Error: suffix or operands invalid for `vpshufb' /tmp/ccxEFnVX.s:1223: Error: suffix or operands invalid for `vpaddb' /tmp/ccxEFnVX.s:1232: Error: suffix or operands invalid for `vpmaddubsw' /tmp/ccxEFnVX.s:1239: Error: suffix or operands invalid for `vpmaddwd' /tmp/ccxEFnVX.s:1245: Error: suffix or operands invalid for `vpshufb' /tmp/ccxEFnVX.s:1251: Error: no such instruction: `vpermd %ymm0,%ymm7,%ymm0' /tmp/ccxEFnVX.s:1282: Error: suffix or operands invalid for `vpsrld' /tmp/ccxEFnVX.s:1289: Error: suffix or operands invalid for `vpand' /tmp/ccxEFnVX.s:1294: Error: suffix or operands invalid for `vpand' /tmp/ccxEFnVX.s:1300: Error: suffix or operands invalid for `vpshufb' /tmp/ccxEFnVX.s:1305: Error: suffix or operands invalid for `vpshufb' make: *** [ext/standard/base64.lo] Error 1 Expected result: ---------------- ll -Wno-strict-aliasing -DZEND_SIGNALS -c /base/pub/source/php-7.4.0/ext/standard/php_crypt_r.c -o ext/standard/php_crypt_r.lo /bin/sh /base/pub/source/php-7.4.0/libtool --silent --preserve-dup-deps --mode=compile cc -DZEND_ENABLE_STATIC_TSRMLS_CACHE=1 -Iext/standard/ -I/base/pub/source/php-7.4.0/ext/standard/ -DPHP_ATOM_INC -I/base/pub/source/php-7.4.0/include -I/base/pub/source/php-7.4.0/main -I/base/pub/source/php-7.4.0 -I/base/pub/source/php-7.4.0/ext/date/lib -I/usr/include/libxml2 -I/usr/local/sqlite/include -I/base/pub/source/php-7.4.0/TSRM -I/base/pub/source/php-7.4.0/Zend -I/usr/include -g -O2 -fvisibility=hidden -Wall -Wno-strict-aliasing -DZEND_SIGNALS -c /base/pub/source/php-7.4.0/ext/standard/array.c -o ext/standard/array.lo /bin/sh /base/pub/source/php-7.4.0/libtool --silent --preserve-dup-deps --mode=compile cc -DZEND_ENABLE_STATIC_TSRMLS_CACHE=1 -Iext/standard/ -I/base/pub/source/php-7.4.0/ext/standard/ -DPHP_ATOM_INC -I/base/pub/source/php-7.4.0/include -I/base/pub/source/php-7.4.0/main -I/base/pub/source/php-7.4.0 -I/base/pub/source/php-7.4.0/ext/date/lib -I/usr/include/libxml2 -I/usr/local/sqlite/include -I/base/pub/source/php-7.4.0/TSRM -I/base/pub/source/php-7.4.0/Zend -I/usr/include -g -O2 -fvisibility=hidden -Wall -Wno-strict-aliasing -DZEND_SIGNALS -c /base/pub/source/php-7.4.0/ext/standard/base64.c -o ext/standard/base64.lo /tmp/ccxEFnVX.s: Assembler messages: /tmp/ccxEFnVX.s:526: Error: no such instruction: `vpermd (%rbx),%ymm1,%ymm1' /tmp/ccxEFnVX.s:557: Error: suffix or operands invalid for `vpshufb' /tmp/ccxEFnVX.s:576: Error: suffix or operands invalid for `vpand' /tmp/ccxEFnVX.s:582: Error: suffix or operands invalid for `vpmulhuw' /tmp/ccxEFnVX.s:588: Error: suffix or operands invalid for `vpand' /tmp/ccxEFnVX.s:594: Error: suffix or operands invalid for `vpmullw' /tmp/ccxEFnVX.s:600: Error: suffix or operands invalid for `vpor' /tmp/ccxEFnVX.s:610: Error: suffix or operands invalid for `vpcmpgtb' /tmp/ccxEFnVX.s:616: Error: suffix or operands invalid for `vpsubusb' /tmp/ccxEFnVX.s:622: Error: suffix or operands invalid for `vpsubb' /tmp/ccxEFnVX.s:628: Error: suffix or operands invalid for `vpshufb' /tmp/ccxEFnVX.s:634: Error: suffix or operands invalid for `vpaddb' /tmp/ccxEFnVX.s:1190: Error: suffix or operands invalid for `vpcmpeqb' /tmp/ccxEFnVX.s:1210: Error: suffix or operands invalid for `vpaddb' /tmp/ccxEFnVX.s:1216: Error: suffix or operands invalid for `vpshufb' /tmp/ccxEFnVX.s:1223: Error: suffix or operands invalid for `vpaddb' /tmp/ccxEFnVX.s:1232: Error: suffix or operands invalid for `vpmaddubsw' /tmp/ccxEFnVX.s:1239: Error: suffix or operands invalid for `vpmaddwd' /tmp/ccxEFnVX.s:1245: Error: suffix or operands invalid for `vpshufb' /tmp/ccxEFnVX.s:1251: Error: no such instruction: `vpermd %ymm0,%ymm7,%ymm0' /tmp/ccxEFnVX.s:1282: Error: suffix or operands invalid for `vpsrld' /tmp/ccxEFnVX.s:1289: Error: suffix or operands invalid for `vpand' /tmp/ccxEFnVX.s:1294: Error: suffix or operands invalid for `vpand' /tmp/ccxEFnVX.s:1300: Error: suffix or operands invalid for `vpshufb' /tmp/ccxEFnVX.s:1305: Error: suffix or operands invalid for `vpshufb' make: *** [ext/standard/base64.lo] Error 1 Actual result: -------------- ll -Wno-strict-aliasing -DZEND_SIGNALS -c /base/pub/source/php-7.4.0/ext/standard/php_crypt_r.c -o ext/standard/php_crypt_r.lo /bin/sh /base/pub/source/php-7.4.0/libtool --silent --preserve-dup-deps --mode=compile cc -DZEND_ENABLE_STATIC_TSRMLS_CACHE=1 -Iext/standard/ -I/base/pub/source/php-7.4.0/ext/standard/ -DPHP_ATOM_INC -I/base/pub/source/php-7.4.0/include -I/base/pub/source/php-7.4.0/main -I/base/pub/source/php-7.4.0 -I/base/pub/source/php-7.4.0/ext/date/lib -I/usr/include/libxml2 -I/usr/local/sqlite/include -I/base/pub/source/php-7.4.0/TSRM -I/base/pub/source/php-7.4.0/Zend -I/usr/include -g -O2 -fvisibility=hidden -Wall -Wno-strict-aliasing -DZEND_SIGNALS -c /base/pub/source/php-7.4.0/ext/standard/array.c -o ext/standard/array.lo /bin/sh /base/pub/source/php-7.4.0/libtool --silent --preserve-dup-deps --mode=compile cc -DZEND_ENABLE_STATIC_TSRMLS_CACHE=1 -Iext/standard/ -I/base/pub/source/php-7.4.0/ext/standard/ -DPHP_ATOM_INC -I/base/pub/source/php-7.4.0/include -I/base/pub/source/php-7.4.0/main -I/base/pub/source/php-7.4.0 -I/base/pub/source/php-7.4.0/ext/date/lib -I/usr/include/libxml2 -I/usr/local/sqlite/include -I/base/pub/source/php-7.4.0/TSRM -I/base/pub/source/php-7.4.0/Zend -I/usr/include -g -O2 -fvisibility=hidden -Wall -Wno-strict-aliasing -DZEND_SIGNALS -c /base/pub/source/php-7.4.0/ext/standard/base64.c -o ext/standard/base64.lo /tmp/ccxEFnVX.s: Assembler messages: /tmp/ccxEFnVX.s:526: Error: no such instruction: `vpermd (%rbx),%ymm1,%ymm1' /tmp/ccxEFnVX.s:557: Error: suffix or operands invalid for `vpshufb' /tmp/ccxEFnVX.s:576: Error: suffix or operands invalid for `vpand' /tmp/ccxEFnVX.s:582: Error: suffix or operands invalid for `vpmulhuw' /tmp/ccxEFnVX.s:588: Error: suffix or operands invalid for `vpand' /tmp/ccxEFnVX.s:594: Error: suffix or operands invalid for `vpmullw' /tmp/ccxEFnVX.s:600: Error: suffix or operands invalid for `vpor' /tmp/ccxEFnVX.s:610: Error: suffix or operands invalid for `vpcmpgtb' /tmp/ccxEFnVX.s:616: Error: suffix or operands invalid for `vpsubusb' /tmp/ccxEFnVX.s:622: Error: suffix or operands invalid for `vpsubb' /tmp/ccxEFnVX.s:628: Error: suffix or operands invalid for `vpshufb' /tmp/ccxEFnVX.s:634: Error: suffix or operands invalid for `vpaddb' /tmp/ccxEFnVX.s:1190: Error: suffix or operands invalid for `vpcmpeqb' /tmp/ccxEFnVX.s:1210: Error: suffix or operands invalid for `vpaddb' /tmp/ccxEFnVX.s:1216: Error: suffix or operands invalid for `vpshufb' /tmp/ccxEFnVX.s:1223: Error: suffix or operands invalid for `vpaddb' /tmp/ccxEFnVX.s:1232: Error: suffix or operands invalid for `vpmaddubsw' /tmp/ccxEFnVX.s:1239: Error: suffix or operands invalid for `vpmaddwd' /tmp/ccxEFnVX.s:1245: Error: suffix or operands invalid for `vpshufb' /tmp/ccxEFnVX.s:1251: Error: no such instruction: `vpermd %ymm0,%ymm7,%ymm0' /tmp/ccxEFnVX.s:1282: Error: suffix or operands invalid for `vpsrld' /tmp/ccxEFnVX.s:1289: Error: suffix or operands invalid for `vpand' /tmp/ccxEFnVX.s:1294: Error: suffix or operands invalid for `vpand' /tmp/ccxEFnVX.s:1300: Error: suffix or operands invalid for `vpshufb' /tmp/ccxEFnVX.s:1305: Error: suffix or operands invalid for `vpshufb' make: *** [ext/standard/base64.lo] Error 1 -- Edit bug report at https://bugs.php.net/bug.php?id=78899&edit=1 -- Fix committed: https://bugs.php.net/fix.php?id=78899&r=fixed Fixed in release: https://bugs.php.net/fix.php?id=78899&r=alreadyfixed Need backtrace: https://bugs.php.net/fix.php?id=78899&r=needtrace Need Reproduce Script: https://bugs.php.net/fix.php?id=78899&r=needscript Try newer version: https://bugs.php.net/fix.php?id=78899&r=oldversion Not developer issue: https://bugs.php.net/fix.php?id=78899&r=support Expected behavior: https://bugs.php.net/fix.php?id=78899&r=notwrong Not enough info: https://bugs.php.net/fix.php?id=78899&r=notenoughinfo Submitted twice: https://bugs.php.net/fix.php?id=78899&r=submittedtwice register_globals: https://bugs.php.net/fix.php?id=78899&r=globals PHP version support discontinued: https://bugs.php.net/fix.php?id=78899&r=phptooold Daylight Savings: https://bugs.php.net/fix.php?id=78899&r=dst IIS Stability: https://bugs.php.net/fix.php?id=78899&r=isapi Install GNU Sed: https://bugs.php.net/fix.php?id=78899&r=gnused Floating point limitations: https://bugs.php.net/fix.php?id=78899&r=float No Zend Extensions: https://bugs.php.net/fix.php?id=78899&r=nozend MySQL Configuration Error: https://bugs.php.net/fix.php?id=78899&r=mysqlcfg

« previous php.bugs (#224012) next »