Bug #79306 [Fbk->NoF]: report LIBZIP_VERSION undeclared when compile.

From: Date: Sun, 19 Apr 2020 04:22:04 +0000
Subject: Bug #79306 [Fbk->NoF]: report LIBZIP_VERSION undeclared when compile.
References: 1  Groups: php.bugs 
Request: Send a blank email to php-bugs+get-226662@lists.php.net to get a copy of this message
Edit report at https://bugs.php.net/bug.php?id=79306&edit=1 ID: 79306 Updated by: php-bugs@lists.php.net Reported by: 1138095873 at qq dot com Summary: report LIBZIP_VERSION undeclared when compile. -Status: Feedback +Status: No Feedback Type: Bug Package: Compile Failure Operating System: Centos6.7 PHP Version: 7.3.15 Assigned To: cmb Private report: N New Comment: No feedback was provided. The bug is being suspended because we assume that you are no longer experiencing the problem. If this is not the case and you are able to provide the information that was requested earlier, please do so and change the status of the bug back to "Re-Opened". Thank you. Previous Comments: ------------------------------------------------------------------------ [2020-04-08 10:45:33] cmb@php.net Which version of libzip did you use for the build? ------------------------------------------------------------------------ [2020-02-25 14:29:26] 1138095873 at qq dot com Description: ------------ configure args: ./configure --enable-fpm --enable-mysqlnd --enable-zip --disable-ipv6 --with-libxml-dir=/usr/local/include/libxml2/ --enable-mbstring --with-ldap --with-gettext --with-gd --with-jpeg-dir --with-png-dir --with-zlib-dir=/usr/local/ --prefix=/usr/local/php issue report: -c /data/php/php-7.3.15/ext/zip/php_zip.c -o ext/zip/php_zip.lo /data/php/php-7.3.15/ext/zip/php_zip.c: In function ‘zm_info_zip’: /data/php/php-7.3.15/ext/zip/php_zip.c:3324: error: ‘LIBZIP_VERSION’ undeclared (first use in this function) /data/php/php-7.3.15/ext/zip/php_zip.c:3324: error: (Each undeclared identifier is reported only once /data/php/php-7.3.15/ext/zip/php_zip.c:3324: error: for each function it appears in.) make: *** [ext/zip/php_zip.lo] Error 1 ------------------------------------------------------------------------ -- Edit this bug report at https://bugs.php.net/bug.php?id=79306&edit=1

« previous php.bugs (#226662) next »