Bug #79562 [Opn]: Failed test compiling imagick.so

From: Date: Sun, 03 May 2020 22:42:46 +0000
Subject: Bug #79562 [Opn]: Failed test compiling imagick.so
References: 1  Groups: php.bugs 
Request: Send a blank email to php-bugs+get-226894@lists.php.net to get a copy of this message
Edit report at https://bugs.php.net/bug.php?id=79562&edit=1 ID: 79562 User updated by: gio at giomadaro dot com Reported by: gio at giomadaro dot com -Summary: Filed test compiling imagick.so +Summary: Failed test compiling imagick.so Status: Open Type: Bug Package: *Compile Issues Operating System: Darwin Kernel Version 16.7.0 -PHP Version: Irrelevant +PHP Version: 7.3.8 Block user comment: N Private report: N New Comment: Tested with php 7.3.8 Previous Comments: ------------------------------------------------------------------------ [2020-05-03 22:25:23] gio at giomadaro dot com Changed related bug ------------------------------------------------------------------------ [2020-05-03 22:23:50] gio at giomadaro dot com Description: ------------ ===================================================================== FAILED TEST SUMMARY --------------------------------------------------------------------- Test Tutorial, svgExample [tests/243_Tutorial_svgExample_basic.phpt] ===================================================================== ===================================================================== WARNED TEST SUMMARY --------------------------------------------------------------------- Test ImagickDraw, getDensity [tests/268_ImagickDraw_getDensity_basic.phpt] (warn: XFAIL section but test passes) ImagickPixel iterator [tests/bug_73840.phpt] (warn: XFAIL section but test passes) ===================================================================== ===================================================================== TEST RESULT SUMMARY --------------------------------------------------------------------- Exts skipped : 0 Exts tested : 52 --------------------------------------------------------------------- Number of tests : 276 260 Tests skipped : 16 ( 5.8%) -------- Tests warned : 2 ( 0.7%) ( 0.8%) Tests failed : 1 ( 0.4%) ( 0.4%) Expected fail : 0 ( 0.0%) ( 0.0%) Tests passed : 257 ( 93.1%) ( 98.8%) --------------------------------------------------------------------- Time taken : 112 seconds ===================================================================== ===================================================================== FAILED TEST SUMMARY --------------------------------------------------------------------- Test Tutorial, svgExample [tests/243_Tutorial_svgExample_basic.phpt] ===================================================================== ===================================================================== WARNED TEST SUMMARY --------------------------------------------------------------------- Test ImagickDraw, getDensity [tests/268_ImagickDraw_getDensity_basic.phpt] (warn: XFAIL section but test passes) ImagickPixel iterator [tests/bug_73840.phpt] (warn: XFAIL section but test passes) ===================================================================== ================================================================================ /Users/gio/Desktop/imagick-3.4.4/imagick-3.4.4/tests/243_Tutorial_svgExample_basic.phpt ================================================================================ Fatal error: Uncaught ImagickException: Unable to read image blob in /Users/gio/Desktop/imagick-3.4.4/imagick-3.4.4/tests/243_Tutorial_svgExample_basic.php:43 Stack trace: #0 /Users/gio/Desktop/imagick-3.4.4/imagick-3.4.4/tests/243_Tutorial_svgExample_basic.php(43): Imagick->readimageblob('<?xml version="...') #1 /Users/gio/Desktop/imagick-3.4.4/imagick-3.4.4/tests/243_Tutorial_svgExample_basic.php(49): svgExample() #2 {main} thrown in /Users/gio/Desktop/imagick-3.4.4/imagick-3.4.4/tests/243_Tutorial_svgExample_basic.php on line 43 ================================================================================ 001+ Fatal error: Uncaught ImagickException: Unable to read image blob in /Users/gio/Desktop/imagick-3.4.4/imagick-3.4.4/tests/243_Tutorial_svgExample_basic.php:43 001- Ok 002+ Stack trace: 003+ #0 /Users/gio/Desktop/imagick-3.4.4/imagick-3.4.4/tests/243_Tutorial_svgExample_basic.php(43): Imagick->readimageblob('<?xml version="...') 004+ #1 /Users/gio/Desktop/imagick-3.4.4/imagick-3.4.4/tests/243_Tutorial_svgExample_basic.php(49): svgExample() 005+ #2 {main} 006+ thrown in /Users/gio/Desktop/imagick-3.4.4/imagick-3.4.4/tests/243_Tutorial_svgExample_basic.php on line 43 ================================================================================ Actual result: -------------- You may have found a problem in PHP. ------------------------------------------------------------------------ -- Edit this bug report at https://bugs.php.net/bug.php?id=79562&edit=1

« previous php.bugs (#226894) next »