Bug #80429 [NEW]: About dynamic library lphp.so in php8, but the lphp7.so in php7
| From: | rryqszq at gmail dot com | Date: | Fri, 27 Nov 2020 03:52:22 +0000 |
| Subject: | Bug #80429 [NEW]: About dynamic library lphp.so in php8, but the lphp7.so in php7 | ||
| Groups: | php.bugs | ||
| Request: | Send a blank email to php-bugs+get-230661@lists.php.net to get a copy of this message | ||
From: rryqszq at gmail dot com
Operating system: linux
PHP version: 8.0Git-2020-11-27 (Git)
Package: Dynamic loading
Bug Type: Bug
Bug description:About dynamic library lphp.so in php8, but the lphp7.so in php7
Description:
------------
About dynamic library lphp.so in php8, but the lphp7.so in php7.
Maybe lphp8.so should be right, or the new chapter is in php8.
```
-Wl,-rpath,/home/travis/build/rryqszq4/ngx_php7/build/php/lib -ldl
-lpthread -lcrypt -lcrypt -lresolv -lcrypt -lreadline -lncurses -lrt
-lbz2 -lutil -lrt -lm -ldl -lxml2 -lssl -lcrypto -lsqlite3 -lz -lcurl
-lxml2 -lsqlite3 -lxml2 -lxml2 -lxml2 -lxml2 -lxml2 -lz -lssl -lcrypto
-lcrypt -L/home/travis/build/rryqszq4/ngx_php7/build/php/lib -lphp8
-lpcre -lz \
-Wl,-E
/usr/bin/ld: cannot find -lphp8
collect2: error: ld returned 1 exit status
objs/Makefile:279: recipe for target 'objs/nginx' failed
make[1]: *** [objs/nginx] Error 1
make[1]: Leaving directory
'/home/travis/build/rryqszq4/ngx_php7/build/nginx-1.12.2'
Makefile:11: recipe for target 'install' failed
make: *** [install] Error 2
ngx_php8 compile failed.
```
--
Edit bug report at https://bugs.php.net/bug.php?id=80429&edit=1
--
Fix committed: https://bugs.php.net/fix.php?id=80429&r=fixed
Fixed in release: https://bugs.php.net/fix.php?id=80429&r=alreadyfixed
Need backtrace: https://bugs.php.net/fix.php?id=80429&r=needtrace
Need Reproduce Script: https://bugs.php.net/fix.php?id=80429&r=needscript
Try newer version: https://bugs.php.net/fix.php?id=80429&r=oldversion
Not developer issue: https://bugs.php.net/fix.php?id=80429&r=support
Expected behavior: https://bugs.php.net/fix.php?id=80429&r=notwrong
Not enough info: https://bugs.php.net/fix.php?id=80429&r=notenoughinfo
Submitted twice: https://bugs.php.net/fix.php?id=80429&r=submittedtwice
register_globals: https://bugs.php.net/fix.php?id=80429&r=globals
PHP version support discontinued: https://bugs.php.net/fix.php?id=80429&r=phptooold
Daylight Savings: https://bugs.php.net/fix.php?id=80429&r=dst
IIS Stability: https://bugs.php.net/fix.php?id=80429&r=isapi
Install GNU Sed: https://bugs.php.net/fix.php?id=80429&r=gnused
Floating point limitations: https://bugs.php.net/fix.php?id=80429&r=float
No Zend Extensions: https://bugs.php.net/fix.php?id=80429&r=nozend
MySQL Configuration Error: https://bugs.php.net/fix.php?id=80429&r=mysqlcfg