Bug #70069 [Opn->Fbk]: --enable-fpm error Unsupported processor

From: Date: Tue, 28 Sep 2021 12:51:09 +0000
Subject: Bug #70069 [Opn->Fbk]: --enable-fpm error Unsupported processor
References: 1  Groups: php.bugs 
Request: Send a blank email to php-bugs+get-236890@lists.php.net to get a copy of this message
Edit report at https://bugs.php.net/bug.php?id=70069&edit=1 ID: 70069 Updated by: cmb@php.net Reported by: ileadu at gmail dot com Summary: --enable-fpm error Unsupported processor -Status: Open +Status: Feedback Type: Bug Package: FPM related Operating System: Linux PHP Version: 5.4.43 -Assigned To: +Assigned To: cmb Block user comment: N Private report: N New Comment: Is this still an issue with any of the actively supported PHP versions[1]? [1] <https://www.php.net/supported-versions.php> Previous Comments: ------------------------------------------------------------------------ [2015-07-14 03:11:50] ileadu at gmail dot com Description: ------------ ./configure --host=arm-linux-gnueabi --disable-all --enable-fpm make Expected result: ---------------- compile successfully Actual result: -------------- /zend_execute.lo main/internal_functions_cli.lo sapi/cli/php_cli.lo sapi/cli/php_http_parser.lo sapi/cli/php_cli_server.lo -lcrypt -lcrypt -lm -lrt -lcrypt -lcrypt -o sapi/cli/php /bin/bash /home/marshall/Downloads/php-5.4.43/libtool --silent --preserve-dup-deps --mode=compile arm-linux-gnueabi-cc -I/home/marshall/Downloads/php-5.4.43/sapi/fpm -Isapi/fpm/ -I/home/marshall/Downloads/php-5.4.43/sapi/fpm/ -DPHP_ATOM_INC -I/home/marshall/Downloads/php-5.4.43/include -I/home/marshall/Downloads/php-5.4.43/main -I/home/marshall/Downloads/php-5.4.43 -I/home/marshall/Downloads/php-5.4.43/ext/date/lib -I/home/marshall/Downloads/php-5.4.43/ext/ereg/regex -I/home/marshall/Downloads/php-5.4.43/TSRM -I/home/marshall/Downloads/php-5.4.43/Zend -g -O2 -fvisibility=hidden -c /home/marshall/Downloads/php-5.4.43/sapi/fpm/fpm/fastcgi.c -o sapi/fpm/fpm/fastcgi.lo /bin/bash /home/marshall/Downloads/php-5.4.43/libtool --silent --preserve-dup-deps --mode=compile arm-linux-gnueabi-cc -I/home/marshall/Downloads/php-5.4.43/sapi/fpm -Isapi/fpm/ -I/home/marshall/Downloads/php-5.4.43/sapi/fpm/ -DPHP_ATOM_INC -I/home/marshall/Downloads/php-5.4.43/include -I/home/marshall/Downloads/php-5.4.43/main -I/home/marshall/Downloads/php-5.4.43 -I/home/marshall/Downloads/php-5.4.43/ext/date/lib -I/home/marshall/Downloads/php-5.4.43/ext/ereg/regex -I/home/marshall/Downloads/php-5.4.43/TSRM -I/home/marshall/Downloads/php-5.4.43/Zend -g -O2 -fvisibility=hidden -c /home/marshall/Downloads/php-5.4.43/sapi/fpm/fpm/fpm.c -o sapi/fpm/fpm/fpm.lo In file included from /home/marshall/Downloads/php-5.4.43/sapi/fpm/fpm/fpm_scoreboard.h:15, from /home/marshall/Downloads/php-5.4.43/sapi/fpm/fpm/fpm.c:21: /home/marshall/Downloads/php-5.4.43/sapi/fpm/fpm/fpm_atomic.h:142:2: error: #error Unsupported processor. Please open a bug report (bugs.php.net). In file included from /home/marshall/Downloads/php-5.4.43/sapi/fpm/fpm/fpm_scoreboard.h:15, from /home/marshall/Downloads/php-5.4.43/sapi/fpm/fpm/fpm.c:21: /home/marshall/Downloads/php-5.4.43/sapi/fpm/fpm/fpm_atomic.h:146: error: expected ')' before '*' token In file included from /home/marshall/Downloads/php-5.4.43/sapi/fpm/fpm/fpm.c:21: /home/marshall/Downloads/php-5.4.43/sapi/fpm/fpm/fpm_scoreboard.h:22: error: expected specifier-qualifier-list before 'atomic_t' /home/marshall/Downloads/php-5.4.43/sapi/fpm/fpm/fpm_scoreboard.h:51: error: expected specifier-qualifier-list before 'atomic_t' make: *** [sapi/fpm/fpm/fpm.lo] Error 1 marshall@marshall-VirtualBox:~/Downloads/php-5.4.43$ ------------------------------------------------------------------------ -- Edit this bug report at https://bugs.php.net/bug.php?id=70069&edit=1

« previous php.bugs (#236890) next »