[php-src] Issue #9695: ABOUT PHP 7.4.32-fpm-alpine3.16 docker install skywalking_agent error issue

From: Date: Sun, 09 Oct 2022 03:25:51 +0000
Subject: [php-src] Issue #9695: ABOUT PHP 7.4.32-fpm-alpine3.16 docker install skywalking_agent error issue
Groups: php.bugs 
Request: Send a blank email to php-bugs+get-242548@lists.php.net to get a copy of this message
Issue: https://github.com/php/php-src/issues/9695 Author: killinitzero ### Description The following error occurred when deploying according to the documentation https://skywalking.apache.org/docs/skywalking-php/next/en/setup/service-agent/php-agent/readme/ Can you help me? --- stderr /usr/local/include/php/Zend/zend_types.h:29:11: fatal error: 'mmintrin.h' file not found thread 'main' panicked at 'Unable to generate bindings: ClangDiagnostic("/usr/local/include/php/Zend/zend_types.h:29:11: fatal error: 'mmintrin.h' file not found\n")', /root/.cargo/registry/src/github.com-1ecc6299db9ec823/phper-sys-0.5.1/build.rs:760:10 note: run with RUST_BACKTRACE=1 environment variable to display a backtrace warning: build failed, waiting for other jobs to finish... error: build failed make: *** [Makefile:191: modules/skywalking_agent.so] Error 101 ERROR: `make' failed /var/www/html # ls /usr/local/include/php/Zend/zend_types.h /usr/local/include/php/Zend/zend_types.h /var/www/html # ls /usr/local/include/php/Zend/zend_types.h /usr/local/include/php/Zend/zend_types.h /var/www/html # du -sh /usr/local/include/php/Zend/zend_types.h 40.0K /usr/local/include/php/Zend/zend_types.h ### PHP Version PHP 7.4.32 ### Operating System alpine 3.16

« previous php.bugs (#242548) next »