[php-src] Issue #10928: PHP Build Failed - Test curl_version() basic functionality [ext/curl/tests/curl_version_basic_001.phpt]

From: Date: Sat, 25 Mar 2023 05:22:46 +0000
Subject: [php-src] Issue #10928: PHP Build Failed - Test curl_version() basic functionality [ext/curl/tests/curl_version_basic_001.phpt]
Groups: php.bugs 
Request: Send a blank email to php-bugs+get-244003@lists.php.net to get a copy of this message
Issue: https://github.com/php/php-src/issues/10928 Author: ZipingL ### Description I'm trying to build my own PHP to better understand how to optimize my shitty wordpress server towards a bottom up approach rather than a top down caching perspective. I don't know what this means. It just says to open up a report. Thank you. You can visit the wordpress server as well [here](https://awsuni.com/%F0%9F%94%A5). - If you regard this report as insignificant please close the report. I honestly hate PHP and only using it because wordpress does. I hate this language so much, in fact, I hate it. I hate web development so much I fucking hate this fucking clown of field. ```php ===================================================================== EXPECTED FAILED TEST SUMMARY --------------------------------------------------------------------- Test open_basedir configuration [tests/security/open_basedir_linkinfo.phpt] XFAIL REASON: BUG: open_basedir cannot delete symlink to prohibited file. See also bugs 48111 and 52176. DateTime::add() -- fall type2 type3 [ext/date/tests/DateTime_add-fall-type2-type3.phpt] XFAIL REASON: Various bugs exist DateTime::add() -- fall type3 type2 [ext/date/tests/DateTime_add-fall-type3-type2.phpt] XFAIL REASON: Various bugs exist DateTime::add() -- fall type3 type3 [ext/date/tests/DateTime_add-fall-type3-type3.phpt] XFAIL REASON: Various bugs exist DateTime::add() -- spring type2 type3 [ext/date/tests/DateTime_add-spring-type2-type3.phpt] XFAIL REASON: Various bugs exist DateTime::add() -- spring type3 type2 [ext/date/tests/DateTime_add-spring-type3-type2.phpt] XFAIL REASON: Various bugs exist DateTime::add() -- spring type3 type3 [ext/date/tests/DateTime_add-spring-type3-type3.phpt] XFAIL REASON: Various bugs exist DateTime::diff() -- fall type2 type3 [ext/date/tests/DateTime_diff-fall-type2-type3.phpt] XFAIL REASON: Various bugs exist DateTime::diff() -- fall type3 type2 [ext/date/tests/DateTime_diff-fall-type3-type2.phpt] XFAIL REASON: Various bugs exist DateTime::diff() -- fall type3 type3 [ext/date/tests/DateTime_diff-fall-type3-type3.phpt] XFAIL REASON: Various bugs exist DateTime::diff() -- spring type2 type3 [ext/date/tests/DateTime_diff-spring-type2-type3.phpt] XFAIL REASON: Various bugs exist DateTime::diff() -- spring type3 type2 [ext/date/tests/DateTime_diff-spring-type3-type2.phpt] XFAIL REASON: Various bugs exist DateTime::diff() -- spring type3 type3 [ext/date/tests/DateTime_diff-spring-type3-type3.phpt] XFAIL REASON: Various bugs exist DateTime::sub() -- fall type2 type3 [ext/date/tests/DateTime_sub-fall-type2-type3.phpt] XFAIL REASON: Various bugs exist DateTime::sub() -- fall type3 type2 [ext/date/tests/DateTime_sub-fall-type3-type2.phpt] XFAIL REASON: Various bugs exist DateTime::sub() -- fall type3 type3 [ext/date/tests/DateTime_sub-fall-type3-type3.phpt] XFAIL REASON: Various bugs exist DateTime::sub() -- spring type2 type3 [ext/date/tests/DateTime_sub-spring-type2-type3.phpt] XFAIL REASON: Various bugs exist DateTime::sub() -- spring type3 type2 [ext/date/tests/DateTime_sub-spring-type3-type2.phpt] XFAIL REASON: Various bugs exist DateTime::sub() -- spring type3 type3 [ext/date/tests/DateTime_sub-spring-type3-type3.phpt] XFAIL REASON: Various bugs exist Bug #42718 (unsafe_raw filter not applied when configured as default filter) [ext/filter/tests/bug42718.phpt] XFAIL REASON: FILTER_UNSAFE_RAW not applied when configured as default filter, even with flags Bug #67296 (filter_input doesn't validate variables) [ext/filter/tests/bug49184.phpt] XFAIL REASON: See Bug #49184 Bug #67167: filter_var(null,FILTER_VALIDATE_BOOLEAN,FILTER_NULL_ON_FAILURE) returns null [ext/filter/tests/bug67167.02.phpt] XFAIL REASON: Requires php_zval_filter to not use convert_to_string for all filters. Output of mb_strcut covers requested range of bytes even when output contains ending escape sequences [ext/mbstring/tests/gh9535b.phpt] XFAIL REASON: Discussion: https://github.com/php/php-src/pull/9562 Return type check elision [ext/opcache/tests/opt/verify_return_type.phpt] XFAIL REASON: Return types cannot be inferred through prototypes via [ext/pdo_sqlite/tests/common.phpt] SQLite PDO Common: PDOStatement::getColumnMeta [ext/pdo_sqlite/tests/pdo_022.phpt] XFAIL REASON: This feature is not yet finalized, no test makes sense updateTimestamp never called when session data is empty [ext/session/tests/user_session_module/bug71162.phpt] XFAIL REASON: Current session module is designed to write empty session always. In addition, current session module only supports SessionHandlerInterface only from PHP 7.0. ===================================================================== ===================================================================== FAILED TEST SUMMARY --------------------------------------------------------------------- Test curl_version() basic functionality [ext/curl/tests/curl_version_basic_001.phpt] ===================================================================== ===================================================================== WARNED TEST SUMMARY --------------------------------------------------------------------- Test hrtime() aligns with microtime() [ext/standard/tests/hrtime/hrtime.phpt] (warn: XFAIL section but test passes) FPM: Buffered worker output decorated log with multiple continuous messages (stdout/stderr mixed) [sapi/fpm/tests/log-bwd-multiple-msgs-stdout-stderr.phpt] (warn: XFAIL section but test passes) ===================================================================== ===================================================================== TEST RESULT SUMMARY --------------------------------------------------------------------- Exts skipped : 31 (pdo_mysql, oci8, xsl, sysvmsg, dl_test, odbc, intl, gmp, readline, tidy, pdo_pgsql, pcntl, skeleton, pdo_oci, pgsql, soap, com_dotnet, gettext, pspell, bz2, sockets, pdo_dblib, sodium, snmp, pdo_firebird, pdo_odbc, ldap, imap, shmop, ffi, zend_test) Exts tested : 42 --------------------------------------------------------------------- Number of tests : 18067 14110 Tests skipped : 3957 ( 21.9%) -------- Tests warned : 2 ( 0.0%) ( 0.0%) Tests failed : 1 ( 0.0%) ( 0.0%) Expected fail : 26 ( 0.1%) ( 0.2%) Tests passed : 14081 ( 77.9%) ( 99.8%) --------------------------------------------------------------------- Time taken : 498 seconds ===================================================================== ===================================================================== EXPECTED FAILED TEST SUMMARY --------------------------------------------------------------------- Test open_basedir configuration [tests/security/open_basedir_linkinfo.phpt] XFAIL REASON: BUG: open_basedir cannot delete symlink to prohibited file. See also bugs 48111 and 52176. DateTime::add() -- fall type2 type3 [ext/date/tests/DateTime_add-fall-type2-type3.phpt] XFAIL REASON: Various bugs exist DateTime::add() -- fall type3 type2 [ext/date/tests/DateTime_add-fall-type3-type2.phpt] XFAIL REASON: Various bugs exist DateTime::add() -- fall type3 type3 [ext/date/tests/DateTime_add-fall-type3-type3.phpt] XFAIL REASON: Various bugs exist DateTime::add() -- spring type2 type3 [ext/date/tests/DateTime_add-spring-type2-type3.phpt] XFAIL REASON: Various bugs exist DateTime::add() -- spring type3 type2 [ext/date/tests/DateTime_add-spring-type3-type2.phpt] XFAIL REASON: Various bugs exist DateTime::add() -- spring type3 type3 [ext/date/tests/DateTime_add-spring-type3-type3.phpt] XFAIL REASON: Various bugs exist DateTime::diff() -- fall type2 type3 [ext/date/tests/DateTime_diff-fall-type2-type3.phpt] XFAIL REASON: Various bugs exist DateTime::diff() -- fall type3 type2 [ext/date/tests/DateTime_diff-fall-type3-type2.phpt] XFAIL REASON: Various bugs exist DateTime::diff() -- fall type3 type3 [ext/date/tests/DateTime_diff-fall-type3-type3.phpt] XFAIL REASON: Various bugs exist DateTime::diff() -- spring type2 type3 [ext/date/tests/DateTime_diff-spring-type2-type3.phpt] XFAIL REASON: Various bugs exist DateTime::diff() -- spring type3 type2 [ext/date/tests/DateTime_diff-spring-type3-type2.phpt] XFAIL REASON: Various bugs exist DateTime::diff() -- spring type3 type3 [ext/date/tests/DateTime_diff-spring-type3-type3.phpt] XFAIL REASON: Various bugs exist DateTime::sub() -- fall type2 type3 [ext/date/tests/DateTime_sub-fall-type2-type3.phpt] XFAIL REASON: Various bugs exist DateTime::sub() -- fall type3 type2 [ext/date/tests/DateTime_sub-fall-type3-type2.phpt] XFAIL REASON: Various bugs exist DateTime::sub() -- fall type3 type3 [ext/date/tests/DateTime_sub-fall-type3-type3.phpt] XFAIL REASON: Various bugs exist DateTime::sub() -- spring type2 type3 [ext/date/tests/DateTime_sub-spring-type2-type3.phpt] XFAIL REASON: Various bugs exist DateTime::sub() -- spring type3 type2 [ext/date/tests/DateTime_sub-spring-type3-type2.phpt] XFAIL REASON: Various bugs exist DateTime::sub() -- spring type3 type3 [ext/date/tests/DateTime_sub-spring-type3-type3.phpt] XFAIL REASON: Various bugs exist Bug #42718 (unsafe_raw filter not applied when configured as default filter) [ext/filter/tests/bug42718.phpt] XFAIL REASON: FILTER_UNSAFE_RAW not applied when configured as default filter, even with flags Bug #67296 (filter_input doesn't validate variables) [ext/filter/tests/bug49184.phpt] XFAIL REASON: See Bug #49184 Bug #67167: filter_var(null,FILTER_VALIDATE_BOOLEAN,FILTER_NULL_ON_FAILURE) returns null [ext/filter/tests/bug67167.02.phpt] XFAIL REASON: Requires php_zval_filter to not use convert_to_string for all filters. Output of mb_strcut covers requested range of bytes even when output contains ending escape sequences [ext/mbstring/tests/gh9535b.phpt] XFAIL REASON: Discussion: https://github.com/php/php-src/pull/9562 Return type check elision [ext/opcache/tests/opt/verify_return_type.phpt] XFAIL REASON: Return types cannot be inferred through prototypes via [ext/pdo_sqlite/tests/common.phpt] SQLite PDO Common: PDOStatement::getColumnMeta [ext/pdo_sqlite/tests/pdo_022.phpt] XFAIL REASON: This feature is not yet finalized, no test makes sense updateTimestamp never called when session data is empty [ext/session/tests/user_session_module/bug71162.phpt] XFAIL REASON: Current session module is designed to write empty session always. In addition, current session module only supports SessionHandlerInterface only from PHP 7.0. ===================================================================== ===================================================================== FAILED TEST SUMMARY --------------------------------------------------------------------- Test curl_version() basic functionality [ext/curl/tests/curl_version_basic_001.phpt] ===================================================================== ===================================================================== WARNED TEST SUMMARY --------------------------------------------------------------------- Test hrtime() aligns with microtime() [ext/standard/tests/hrtime/hrtime.phpt] (warn: XFAIL section but test passes) FPM: Buffered worker output decorated log with multiple continuous messages (stdout/stderr mixed) [sapi/fpm/tests/log-bwd-multiple-msgs-stdout-stderr.phpt] (warn: XFAIL section but test passes) ===================================================================== ================================================================================ /home/ubuntu/php-src/ext/curl/tests/curl_version_basic_001.phpt ================================================================================ int(524289) int(10) int(1361625749) int(0) string(5) "8.0.1" string(19) "x86_64-pc-linux-gnu" string(13) "OpenSSL/3.0.2" string(0) "" bool(true) ================================================================================ -- string(%i) "%s" string(%i) "%s" string(%i) "%s" 008- string(%i) "%s" 008+ string(0) "" bool(true) ================================================================================ ================================================================================ BUILD ENVIRONMENT ================================================================================ OS: Linux - Linux ip-172-31-22-211 5.15.0-1031-aws #35-Ubuntu SMP Fri Feb 10 02:07:18 UTC 2023 x86_64 Autoconf: autoconf (GNU Autoconf) 2.71 Copyright (C) 2021 Free Software Foundation, Inc. License GPLv3+/Autoconf: GNU GPL version 3 or later <https://gnu.org/licenses/gpl.html>, <https://gnu.org/licenses/exceptions.html> This is free software: you are free to change and redistribute it. There is NO WARRANTY, to the extent permitted by law. Written by David J. MacKenzie and Akim Demaille. Bundled Libtool: ltmain.sh (GNU libtool) 1.5.26 (1.1220.2.492 2008/01/30 06:40:56) Copyright (C) 2008 Free Software Foundation, Inc. This is free software; see the source for copying conditions. There is NO warranty; not even for MERCHANTABILITY or FITNESS FOR A PARTICULAR PURPOSE. System Libtool: N/A Compiler: Using built-in specs. COLLECT_GCC=cc COLLECT_LTO_WRAPPER=/usr/lib/gcc/x86_64-linux-gnu/11/lto-wrapper OFFLOAD_TARGET_NAMES=nvptx-none:amdgcn-amdhsa OFFLOAD_TARGET_DEFAULT=1 Target: x86_64-linux-gnu Configured with: ../src/configure -v --with-pkgversion='Ubuntu 11.3.0-1ubuntu1~22.04' --with-bugurl=file:///usr/share/doc/gcc-11/README.Bugs --enable-languages=c,ada,c++,go,brig,d,fortran,objc,obj-c++,m2 --prefix=/usr --with-gcc-major-version-only --program-suffix=-11 --program-prefix=x86_64-linux-gnu- --enable-shared --enable-linker-build-id --libexecdir=/usr/lib --without-included-gettext --enable-threads=posix --libdir=/usr/lib --enable-nls --enable-bootstrap --enable-clocale=gnu --enable-libstdcxx-debug --enable-libstdcxx-time=yes --with-default-libstdcxx-abi=new --enable-gnu-unique-object --disable-vtable-verify --enable-plugin --enable-default-pie --with-system-zlib --enable-libphobos-checking=release --with-target-system-zlib=auto --enable-objc-gc=auto --enable-multiarch --disable-werror --enable-cet --with-arch-32=i686 --with-abi=m64 --with-multilib-list=m32,m64,mx32 --enable-multilib --with-tune=generic --enable-offload-targets=nvptx-none=/build/gcc-11-xKiWfi/gcc-11-11.3.0/debian/tmp-nvptx/usr,amdgcn-amdhsa=/build/gcc-11-xKiWfi/gcc-11-11.3.0/debian/tmp-gcn/usr --without-cuda-driver --enable-checking=release --build=x86_64-linux-gnu --host=x86_64-linux-gnu --target=x86_64-linux-gnu --with-build-config=bootstrap-lto-lean --enable-link-serialization=2 Thread model: posix Supported LTO compression algorithms: zlib zstd gcc version 11.3.0 (Ubuntu 11.3.0-1ubuntu1~22.04) Bison: bison (GNU Bison) 3.8.2 Written by Robert Corbett and Richard Stallman. Copyright (C) 2021 Free Software Foundation, Inc. This is free software; see the source for copying conditions. There is NO warranty; not even for MERCHANTABILITY or FITNESS FOR A PARTICULAR PURPOSE. Libraries: linux-vdso.so.1 (0x00007fffa6c45000) libm.so.6 => /lib/x86_64-linux-gnu/libm.so.6 (0x00007f0a17d19000) libxml2.so.2 => /lib/x86_64-linux-gnu/libxml2.so.2 (0x00007f0a17b37000) libssl.so.3 => /lib/x86_64-linux-gnu/libssl.so.3 (0x00007f0a17a93000) libcrypto.so.3 => /lib/x86_64-linux-gnu/libcrypto.so.3 (0x00007f0a17650000) libpcre2-8.so.0 => /lib/x86_64-linux-gnu/libpcre2-8.so.0 (0x00007f0a19431000) libsqlite3.so.0 => /lib/x86_64-linux-gnu/libsqlite3.so.0 (0x00007f0a17503000) libz.so.1 => /lib/x86_64-linux-gnu/libz.so.1 (0x00007f0a174e7000) libcurl.so.4 => /usr/local/lib/libcurl.so.4 (0x00007f0a17450000) libenchant-2.so.2 => /lib/x86_64-linux-gnu/libenchant-2.so.2 (0x00007f0a17442000) libpng16.so.16 => /lib/x86_64-linux-gnu/libpng16.so.16 (0x00007f0a17407000) libavif.so.13 => /lib/x86_64-linux-gnu/libavif.so.13 (0x00007f0a173e4000) libwebp.so.7 => /lib/x86_64-linux-gnu/libwebp.so.7 (0x00007f0a17378000) libXpm.so.4 => /lib/x86_64-linux-gnu/libXpm.so.4 (0x00007f0a17363000) libfreetype.so.6 => /lib/x86_64-linux-gnu/libfreetype.so.6 (0x00007f0a1729b000) libonig.so.5 => /lib/x86_64-linux-gnu/libonig.so.5 (0x00007f0a17208000) libzip.so.4 => /lib/x86_64-linux-gnu/libzip.so.4 (0x00007f0a171ea000) libc.so.6 => /lib/x86_64-linux-gnu/libc.so.6 (0x00007f0a16fc2000) /lib64/ld-linux-x86-64.so.2 (0x00007f0a194db000) libicuuc.so.70 => /lib/x86_64-linux-gnu/libicuuc.so.70 (0x00007f0a16dc7000) liblzma.so.5 => /lib/x86_64-linux-gnu/liblzma.so.5 (0x00007f0a16d9c000) libgmodule-2.0.so.0 => /lib/x86_64-linux-gnu/libgmodule-2.0.so.0 (0x00007f0a16d95000) libglib-2.0.so.0 => /lib/x86_64-linux-gnu/libglib-2.0.so.0 (0x00007f0a16c5b000) libdav1d.so.5 => /lib/x86_64-linux-gnu/libdav1d.so.5 (0x00007f0a16ad5000) libgav1.so.0 => /lib/x86_64-linux-gnu/libgav1.so.0 (0x00007f0a169f9000) libaom.so.3 => /lib/x86_64-linux-gnu/libaom.so.3 (0x00007f0a16489000) libyuv.so.0 => /lib/x86_64-linux-gnu/libyuv.so.0 (0x00007f0a16407000) libX11.so.6 => /lib/x86_64-linux-gnu/libX11.so.6 (0x00007f0a162c7000) libbrotlidec.so.1 => /lib/x86_64-linux-gnu/libbrotlidec.so.1 (0x00007f0a162b9000) libbz2.so.1.0 => /lib/x86_64-linux-gnu/libbz2.so.1.0 (0x00007f0a162a4000) libicudata.so.70 => /lib/x86_64-linux-gnu/libicudata.so.70 (0x00007f0a14686000) libstdc++.so.6 => /lib/x86_64-linux-gnu/libstdc++.so.6 (0x00007f0a1445c000) libgcc_s.so.1 => /lib/x86_64-linux-gnu/libgcc_s.so.1 (0x00007f0a1443c000) libpcre.so.3 => /lib/x86_64-linux-gnu/libpcre.so.3 (0x00007f0a143c6000) libabsl_synchronization.so.20210324 => /lib/x86_64-linux-gnu/libabsl_synchronization.so.20210324 (0x00007f0a143b4000) libjpeg.so.8 => /lib/x86_64-linux-gnu/libjpeg.so.8 (0x00007f0a14331000) libxcb.so.1 => /lib/x86_64-linux-gnu/libxcb.so.1 (0x00007f0a14307000) libbrotlicommon.so.1 => /lib/x86_64-linux-gnu/libbrotlicommon.so.1 (0x00007f0a142e4000) libabsl_graphcycles_internal.so.20210324 => /lib/x86_64-linux-gnu/libabsl_graphcycles_internal.so.20210324 (0x00007f0a142dc000) libabsl_stacktrace.so.20210324 => /lib/x86_64-linux-gnu/libabsl_stacktrace.so.20210324 (0x00007f0a142d7000) libabsl_symbolize.so.20210324 => /lib/x86_64-linux-gnu/libabsl_symbolize.so.20210324 (0x00007f0a142cc000) libabsl_time.so.20210324 => /lib/x86_64-linux-gnu/libabsl_time.so.20210324 (0x00007f0a142b9000) libabsl_malloc_internal.so.20210324 => /lib/x86_64-linux-gnu/libabsl_malloc_internal.so.20210324 (0x00007f0a142b3000) libabsl_base.so.20210324 => /lib/x86_64-linux-gnu/libabsl_base.so.20210324 (0x00007f0a142ac000) libabsl_spinlock_wait.so.20210324 => /lib/x86_64-linux-gnu/libabsl_spinlock_wait.so.20210324 (0x00007f0a142a7000) libabsl_raw_logging_internal.so.20210324 => /lib/x86_64-linux-gnu/libabsl_raw_logging_internal.so.20210324 (0x00007f0a142a2000) libXau.so.6 => /lib/x86_64-linux-gnu/libXau.so.6 (0x00007f0a1429a000) libXdmcp.so.6 => /lib/x86_64-linux-gnu/libXdmcp.so.6 (0x00007f0a14292000) libabsl_debugging_internal.so.20210324 => /lib/x86_64-linux-gnu/libabsl_debugging_internal.so.20210324 (0x00007f0a1428b000) libabsl_demangle_internal.so.20210324 => /lib/x86_64-linux-gnu/libabsl_demangle_internal.so.20210324 (0x00007f0a14280000) libabsl_strings.so.20210324 => /lib/x86_64-linux-gnu/libabsl_strings.so.20210324 (0x00007f0a14261000) libabsl_time_zone.so.20210324 => /lib/x86_64-linux-gnu/libabsl_time_zone.so.20210324 (0x00007f0a14245000) libabsl_int128.so.20210324 => /lib/x86_64-linux-gnu/libabsl_int128.so.20210324 (0x00007f0a1423d000) libbsd.so.0 => /lib/x86_64-linux-gnu/libbsd.so.0 (0x00007f0a14225000) libabsl_strings_internal.so.20210324 => /lib/x86_64-linux-gnu/libabsl_strings_internal.so.20210324 (0x00007f0a1421f000) libabsl_throw_delegate.so.20210324 => /lib/x86_64-linux-gnu/libabsl_throw_delegate.so.20210324 (0x00007f0a14218000) libmd.so.0 => /lib/x86_64-linux-gnu/libmd.so.0 (0x00007f0a14209000) ================================================================================ PHPINFO ================================================================================ phpinfo() PHP Version => 8.3.0-dev System => Linux ip-172-31-22-211 5.15.0-1031-aws #35-Ubuntu SMP Fri Feb 10 02:07:18 UTC 2023 x86_64 Build Date => Mar 25 2023 04:40:58 Build System => Linux ip-172-31-22-211 5.15.0-1031-aws #35-Ubuntu SMP Fri Feb 10 02:07:18 UTC 2023 x86_64 x86_64 x86_64 GNU/Linux Configure Command => './configure' '--with-openssl' '--with-system-ciphers' '--with-external-pcre' '--with-zlib' '--enable-bcmath' '--enable-calendar' '--with-curl' '--enable-dba' '--enable-exif' '--with-enchant' '--with-openssl-dir' '--enable-gd' '--with-webp' '--with-avif' '--with-xpm' '--with-freetype' '--with-mysqli' '--enable-mbstring' '--enable-sysvshm' '--enable-sysvsem' '--with-zip' '--enable-fpm' '--enable-ftp' Server API => Command Line Interface Virtual Directory Support => disabled Configuration File (php.ini) Path => /usr/local/lib Loaded Configuration File => (none) Scan this dir for additional .ini files => (none) Additional .ini files parsed => (none) PHP API => 20220830 PHP Extension => 20220830 Zend Extension => 420220830 Zend Extension Build => API420220830,NTS PHP Extension Build => API20220830,NTS Debug Build => no Thread Safety => disabled Zend Signal Handling => enabled Zend Memory Manager => enabled Zend Multibyte Support => provided by mbstring Zend Max Execution Timers => disabled IPv6 Support => enabled DTrace Support => disabled Registered PHP Streams => https, ftps, compress.zlib, php, file, glob, data, http, ftp, phar, zip Registered Stream Socket Transports => tcp, udp, unix, udg, ssl, tls, tlsv1.0, tlsv1.1, tlsv1.2, tlsv1.3 Registered Stream Filters => zlib.*, convert.iconv.*, string.rot13, string.toupper, string.tolower, convert.*, consumed, dechunk This program makes use of the Zend Scripting Language Engine: Zend Engine v4.3.0-dev, Copyright (c) Zend Technologies _______________________________________________________________________ Configuration bcmath BCMath support => enabled Directive => Local Value => Master Value bcmath.scale => 0 => 0 calendar Calendar support => enabled Core PHP Version => 8.3.0-dev Directive => Local Value => Master Value allow_url_fopen => On => On allow_url_include => Off => Off arg_separator.input => & => & arg_separator.output => & => & auto_append_file => no value => no value auto_globals_jit => On => On auto_prepend_file => no value => no value browscap => no value => no value default_charset => UTF-8 => UTF-8 default_mimetype => text/html => text/html disable_classes => no value => no value disable_functions => no value => no value display_errors => STDERR => STDERR display_startup_errors => On => On doc_root => no value => no value docref_ext => no value => no value docref_root => no value => no value enable_dl => On => On enable_post_data_reading => On => On error_append_string => no value => no value error_log => no value => no value error_log_mode => 0644 => 0644 error_prepend_string => no value => no value error_reporting => no value => no value expose_php => On => On extension_dir => /usr/local/lib/php/extensions/no-debug-non-zts-20220830 => /usr/local/lib/php/extensions/no-debug-non-zts-20220830 fiber.stack_size => no value => no value file_uploads => On => On hard_timeout => 2 => 2 highlight.comment => <font style="color: #FF8000">#FF8000</font> => <font style="color: #FF8000">#FF8000</font> highlight.default => <font style="color: #0000BB">#0000BB</font> => <font style="color: #0000BB">#0000BB</font> highlight.html => <font style="color: #000000">#000000</font> => <font style="color: #000000">#000000</font> highlight.keyword => <font style="color: #007700">#007700</font> => <font style="color: #007700">#007700</font> highlight.string => <font style="color: #DD0000">#DD0000</font> => <font style="color: #DD0000">#DD0000</font> html_errors => Off => Off ignore_repeated_errors => Off => Off ignore_repeated_source => Off => Off ignore_user_abort => Off => Off implicit_flush => On => On include_path => .: => .: input_encoding => no value => no value internal_encoding => no value => no value log_errors => Off => Off mail.add_x_header => Off => Off mail.force_extra_parameters => no value => no value mail.log => no value => no value mail.mixed_lf_and_crlf => Off => Off max_execution_time => 0 => 0 max_file_uploads => 20 => 20 max_input_nesting_level => 64 => 64 max_input_time => -1 => -1 max_input_vars => 1000 => 1000 max_multipart_body_parts => -1 => -1 memory_limit => 128M => 128M open_basedir => no value => no value output_buffering => 0 => 0 output_encoding => no value => no value output_handler => no value => no value post_max_size => 8M => 8M precision => 14 => 14 realpath_cache_size => 4096K => 4096K realpath_cache_ttl => 120 => 120 register_argc_argv => On => On report_memleaks => On => On report_zend_debug => Off => Off request_order => no value => no value sendmail_from => no value => no value sendmail_path => /usr/sbin/sendmail -t -i => /usr/sbin/sendmail -t -i serialize_precision => -1 => -1 short_open_tag => On => On SMTP => localhost => localhost smtp_port => 25 => 25 sys_temp_dir => no value => no value syslog.facility => LOG_USER => LOG_USER syslog.filter => no-ctrl => no-ctrl syslog.ident => php => php unserialize_callback_func => no value => no value upload_max_filesize => 2M => 2M upload_tmp_dir => no value => no value user_dir => no value => no value user_ini.cache_ttl => 300 => 300 user_ini.filename => .user.ini => .user.ini variables_order => EGPCS => EGPCS xmlrpc_error_number => 0 => 0 xmlrpc_errors => Off => Off zend.assertions => 1 => 1 zend.detect_unicode => On => On zend.enable_gc => On => On zend.exception_ignore_args => Off => Off zend.exception_string_param_max_len => 15 => 15 zend.max_allowed_stack_size => 0 => 0 zend.multibyte => Off => Off zend.reserved_stack_size => 0 => 0 zend.script_encoding => no value => no value zend.signal_check => Off => Off ctype ctype functions => enabled curl cURL support => enabled cURL Information => 8.0.1 Age => 10 Features AsynchDNS => Yes CharConv => No Debug => No GSS-Negotiate => No IDN => No IPv6 => Yes krb4 => No Largefile => Yes libz => No NTLM => Yes NTLMWB => Yes SPNEGO => No SSL => Yes SSPI => No TLS-SRP => Yes HTTP2 => No GSSAPI => No KERBEROS5 => No UNIX_SOCKETS => Yes PSL => No HTTPS_PROXY => Yes MULTI_SSL => No BROTLI => No ALTSVC => Yes HTTP3 => No UNICODE => No ZSTD => No HSTS => Yes GSASL => No Protocols => dict, file, ftp, ftps, gopher, gophers, http, https, imap, imaps, mqtt, pop3, pop3s, rtsp, smb, smbs, smtp, smtps, telnet, tftp Host => x86_64-pc-linux-gnu SSL Version => OpenSSL/3.0.2 Directive => Local Value => Master Value curl.cainfo => no value => no value date date/time support => enabled timelib version => 2022.05 "Olson" Timezone Database Version => 2023.2 Timezone Database => internal Default timezone => UTC Directive => Local Value => Master Value date.default_latitude => 31.7667 => 31.7667 date.default_longitude => 35.2333 => 35.2333 date.sunrise_zenith => 90.833333 => 90.833333 date.sunset_zenith => 90.833333 => 90.833333 date.timezone => UTC => UTC dba DBA support => enabled Supported handlers => cdb cdb_make inifile flatfile Directive => Local Value => Master Value dba.default_handler => flatfile => flatfile dom DOM/XML => enabled DOM/XML API Version => 20031129 libxml Version => 2.9.14 HTML Support => enabled XPath Support => enabled XPointer Support => enabled Schema Support => enabled RelaxNG Support => enabled enchant enchant support => enabled Libenchant Version => 2.3.2 hunspell => Hunspell Provider => /usr/lib/x86_64-linux-gnu/enchant-2/enchant_hunspell.so hspell => Hspell Provider => /usr/lib/x86_64-linux-gnu/enchant-2/enchant_hspell.so aspell => Aspell Provider => /usr/lib/x86_64-linux-gnu/enchant-2/enchant_aspell.so exif EXIF Support => enabled Supported EXIF Version => 0220 Supported filetypes => JPEG, TIFF Multibyte decoding support using mbstring => enabled Extended EXIF tag formats => Canon, Casio, Fujifilm, Nikon, Olympus, Samsung, Panasonic, DJI, Sony, Pentax, Minolta, Sigma, Foveon, Kyocera, Ricoh, AGFA, Epson Directive => Local Value => Master Value exif.decode_jis_intel => JIS => JIS exif.decode_jis_motorola => JIS => JIS exif.decode_unicode_intel => UCS-2LE => UCS-2LE exif.decode_unicode_motorola => UCS-2BE => UCS-2BE exif.encode_jis => no value => no value exif.encode_unicode => ISO-8859-15 => ISO-8859-15 fileinfo fileinfo support => enabled libmagic => 543 filter Input Validation and Filtering => enabled Directive => Local Value => Master Value filter.default => unsafe_raw => unsafe_raw filter.default_flags => no value => no value ftp FTP support => enabled FTPS support => enabled gd GD Support => enabled GD Version => bundled (2.1.0 compatible) FreeType Support => enabled FreeType Linkage => with freetype FreeType Version => 2.11.1 GIF Read Support => enabled GIF Create Support => enabled PNG Support => enabled libPNG Version => 1.6.37 WBMP Support => enabled XPM Support => enabled libXpm Version => 30411 XBM Support => enabled WebP Support => enabled BMP Support => enabled AVIF Support => enabled TGA Read Support => enabled Directive => Local Value => Master Value gd.jpeg_ignore_warning => On => On hash hash support => enabled Hashing Engines => md2 md4 md5 sha1 sha224 sha256 sha384 sha512/224 sha512/256 sha512 sha3-224 sha3-256 sha3-384 sha3-512 ripemd128 ripemd160 ripemd256 ripemd320 whirlpool tiger128,3 tiger160,3 tiger192,3 tiger128,4 tiger160,4 tiger192,4 snefru snefru256 gost gost-crypto adler32 crc32 crc32b crc32c fnv132 fnv1a32 fnv164 fnv1a64 joaat murmur3a murmur3c murmur3f xxh32 xxh64 xxh3 xxh128 haval128,3 haval160,3 haval192,3 haval224,3 haval256,3 haval128,4 haval160,4 haval192,4 haval224,4 haval256,4 haval128,5 haval160,5 haval192,5 haval224,5 haval256,5 iconv iconv support => enabled iconv implementation => glibc iconv library version => 2.35 Directive => Local Value => Master Value iconv.input_encoding => no value => no value iconv.internal_encoding => no value => no value iconv.output_encoding => no value => no value json json support => enabled libxml libXML support => active libXML Compiled Version => 2.9.14 libXML Loaded Version => 20914 libXML streams => enabled mbstring Multibyte Support => enabled Multibyte string engine => libmbfl HTTP input encoding translation => disabled libmbfl version => 1.3.2 mbstring extension makes use of "streamable kanji code filter and converter", which is distributed under the GNU Lesser General Public License version 2.1. Multibyte (japanese) regex support => enabled Multibyte regex (oniguruma) version => 6.9.7 Directive => Local Value => Master Value mbstring.detect_order => no value => no value mbstring.encoding_translation => Off => Off mbstring.http_input => no value => no value mbstring.http_output => no value => no value mbstring.http_output_conv_mimetypes => ^(text/|application/xhtml\+xml) => ^(text/|application/xhtml\+xml) mbstring.internal_encoding => no value => no value mbstring.language => neutral => neutral mbstring.regex_retry_limit => 1000000 => 1000000 mbstring.regex_stack_limit => 100000 => 100000 mbstring.strict_detection => Off => Off mbstring.substitute_character => no value => no value mysqli MysqlI Support => enabled Client API library version => mysqlnd 8.3.0-dev Active Persistent Links => 0 Inactive Persistent Links => 0 Active Links => 0 Directive => Local Value => Master Value mysqli.allow_local_infile => Off => Off mysqli.allow_persistent => On => On mysqli.default_host => no value => no value mysqli.default_port => 3306 => 3306 mysqli.default_pw => no value => no value mysqli.default_socket => no value => no value mysqli.default_user => no value => no value mysqli.local_infile_directory => no value => no value mysqli.max_links => Unlimited => Unlimited mysqli.max_persistent => Unlimited => Unlimited mysqli.rollback_on_cached_plink => Off => Off mysqlnd mysqlnd => enabled Version => mysqlnd 8.3.0-dev Compression => supported core SSL => supported extended SSL => supported Command buffer size => 4096 Read buffer size => 32768 Read timeout => 86400 Collecting statistics => Yes Collecting memory statistics => No Tracing => n/a Loaded plugins => mysqlnd,debug_trace,auth_plugin_mysql_native_password,auth_plugin_mysql_clear_password,auth_plugin_caching_sha2_password,auth_plugin_sha256_password API Extensions => mysqli openssl OpenSSL support => enabled OpenSSL Library Version => OpenSSL 3.0.2 15 Mar 2022 OpenSSL Header Version => OpenSSL 3.0.2 15 Mar 2022 Openssl default config => /usr/lib/ssl/openssl.cnf Directive => Local Value => Master Value openssl.cafile => no value => no value openssl.capath => no value => no value pcre PCRE (Perl Compatible Regular Expressions) Support => enabled PCRE Library Version => 10.40 2022-04-14 PCRE Unicode Version => 14.0.0 PCRE JIT Support => enabled PCRE JIT Target => x86 64bit (little endian + unaligned) Directive => Local Value => Master Value pcre.backtrack_limit => 1000000 => 1000000 pcre.jit => On => On pcre.recursion_limit => 100000 => 100000 PDO PDO support => enabled PDO drivers => sqlite pdo_sqlite PDO Driver for SQLite 3.x => enabled SQLite Library => 3.37.2 Phar Phar: PHP Archive support => enabled Phar API version => 1.1.1 Phar-based phar archives => enabled Tar-based phar archives => enabled ZIP-based phar archives => enabled gzip compression => enabled bzip2 compression => disabled (install ext/bz2) Native OpenSSL support => enabled Phar based on pear/PHP_Archive, original concept by Davey Shafik. Phar fully realized by Gregory Beaver and Marcus Boerger. Portions of tar implementation Copyright (c) 2003-2009 Tim Kientzle. Directive => Local Value => Master Value phar.cache_list => no value => no value phar.readonly => On => On phar.require_hash => On => On posix POSIX support => enabled random Version => 8.3.0-dev Reflection Reflection => enabled session Session Support => enabled Registered save handlers => files user Registered serializer handlers => php_serialize php php_binary Directive => Local Value => Master Value session.auto_start => Off => Off session.cache_expire => 180 => 180 session.cache_limiter => nocache => nocache session.cookie_domain => no value => no value session.cookie_httponly => Off => Off session.cookie_lifetime => 0 => 0 session.cookie_path => / => / session.cookie_samesite => no value => no value session.cookie_secure => Off => Off session.gc_divisor => 100 => 100 session.gc_maxlifetime => 1440 => 1440 session.gc_probability => 1 => 1 session.lazy_write => On => On session.name => PHPSESSID => PHPSESSID session.referer_check => no value => no value session.save_handler => files => files session.save_path => no value => no value session.serialize_handler => php => php session.sid_bits_per_character => 4 => 4 session.sid_length => 32 => 32 session.upload_progress.cleanup => On => On session.upload_progress.enabled => On => On session.upload_progress.freq => 1% => 1% session.upload_progress.min_freq => 1 => 1 session.upload_progress.name => PHP_SESSION_UPLOAD_PROGRESS => PHP_SESSION_UPLOAD_PROGRESS session.upload_progress.prefix => upload_progress_ => upload_progress_ session.use_cookies => On => On session.use_only_cookies => On => On session.use_strict_mode => Off => Off session.use_trans_sid => Off => Off SimpleXML SimpleXML support => enabled Schema support => enabled SPL SPL support => enabled Interfaces => OuterIterator, RecursiveIterator, SeekableIterator, SplObserver, SplSubject Classes => AppendIterator, ArrayIterator, ArrayObject, BadFunctionCallException, BadMethodCallException, CachingIterator, CallbackFilterIterator, DirectoryIterator, DomainException, EmptyIterator, FilesystemIterator, FilterIterator, GlobIterator, InfiniteIterator, InvalidArgumentException, IteratorIterator, LengthException, LimitIterator, LogicException, MultipleIterator, NoRewindIterator, OutOfBoundsException, OutOfRangeException, OverflowException, ParentIterator, RangeException, RecursiveArrayIterator, RecursiveCachingIterator, RecursiveCallbackFilterIterator, RecursiveDirectoryIterator, RecursiveFilterIterator, RecursiveIteratorIterator, RecursiveRegexIterator, RecursiveTreeIterator, RegexIterator, RuntimeException, SplDoublyLinkedList, SplFileInfo, SplFileObject, SplFixedArray, SplHeap, SplMinHeap, SplMaxHeap, SplObjectStorage, SplPriorityQueue, SplQueue, SplStack, SplTempFileObject, UnderflowException, UnexpectedValueException sqlite3 SQLite3 support => enabled SQLite Library => 3.37.2 Directive => Local Value => Master Value sqlite3.defensive => On => On sqlite3.extension_dir => no value => no value standard Dynamic Library Support => enabled Path to sendmail => /usr/sbin/sendmail -t -i Directive => Local Value => Master Value assert.active => On => On assert.bail => Off => Off assert.callback => no value => no value assert.exception => On => On assert.warning => On => On auto_detect_line_endings => Off => Off default_socket_timeout => 60 => 60 from => no value => no value session.trans_sid_hosts => no value => no value session.trans_sid_tags => a=href,area=href,frame=src,form= => a=href,area=href,frame=src,form= unserialize_max_depth => 4096 => 4096 url_rewriter.hosts => no value => no value url_rewriter.tags => form= => form= user_agent => no value => no value sysvsem sysvsem support => enabled sysvshm sysvshm support => enabled tokenizer Tokenizer Support => enabled xml XML Support => active XML Namespace Support => active libxml2 Version => 2.9.14 xmlreader XMLReader => enabled xmlwriter XMLWriter => enabled zip Zip => enabled Zip version => 1.21.1 Libzip version => 1.7.3 BZIP2 compression => Yes XZ compression => No ZSTD compression => No AES-128 encryption => Yes AES-192 encryption => Yes AES-256 encryption => Yes zlib ZLib Support => enabled Stream Wrapper => compress.zlib:// Stream Filter => zlib.inflate, zlib.deflate Compiled Version => 1.2.11 Linked Version => 1.2.11 Directive => Local Value => Master Value zlib.output_compression => Off => Off zlib.output_compression_level => -1 => -1 zlib.output_handler => no value => no value Additional Modules Module Name Environment Variable => Value USER => ubuntu SSH_CLIENT => deleted XDG_SESSION_TYPE => tty SHLVL => 2 TEST_PHP_SRCDIR => /home/ubuntu/php-src LESS => -R MOTD_SHOWN => pam HOME => /home/ubuntu OLDPWD => /home/ubuntu SSH_TTY => deleted LSCOLORS => Gxfxcxdxbxegedabagacad ZSH => /home/ubuntu/.oh-my-zsh PAGER => less TEST_PHP_CGI_EXECUTABLE => /home/ubuntu/php-src/sapi/cgi/php-cgi MAKEFLAGS => DBUS_SESSION_BUS_ADDRESS => unix:path=/run/user/1000/bus MAKE_TERMERR => /dev/pts/11 LOGNAME => ubuntu TEST_PHP_EXECUTABLE => /home/ubuntu/php-src/sapi/cli/php _ => /home/ubuntu/php-src/sapi/cli/php XDG_SESSION_CLASS => user TERM => xterm-256color XDG_SESSION_ID => 211 PATH => /home/ubuntu/bin:/usr/local/bin:/usr/local/sbin:/usr/local/bin:/usr/sbin:/usr/bin:/sbin:/bin:/usr/games:/usr/local/games:/snap/bin TEST_PHP_CGI_EXECUTABLE_ESCAPED => '/home/ubuntu/php-src/sapi/cgi/php-cgi' MAKELEVEL => 1 XDG_RUNTIME_DIR => /run/user/1000 LANG => C.UTF-8 LS_COLORS => rs=0:di=01;34:ln=01;36:mh=00:pi=40;33:so=01;35:do=01;35:bd=40;33;01:cd=40;33;01:or=40;31;01:mi=00:su=37;41:sg=30;43:ca=30;41:tw=30;42:ow=34;42:st=37;44:ex=01;32:*.tar=01;31:*.tgz=01;31:*.arc=01;31:*.arj=01;31:*.taz=01;31:*.lha=01;31:*.lz4=01;31:*.lzh=01;31:*.lzma=01;31:*.tlz=01;31:*.txz=01;31:*.tzo=01;31:*.t7z=01;31:*.zip=01;31:*.z=01;31:*.dz=01;31:*.gz=01;31:*.lrz=01;31:*.lz=01;31:*.lzo=01;31:*.xz=01;31:*.zst=01;31:*.tzst=01;31:*.bz2=01;31:*.bz=01;31:*.tbz=01;31:*.tbz2=01;31:*.tz=01;31:*.deb=01;31:*.rpm=01;31:*.jar=01;31:*.war=01;31:*.ear=01;31:*.sar=01;31:*.rar=01;31:*.alz=01;31:*.ace=01;31:*.zoo=01;31:*.cpio=01;31:*.7z=01;31:*.rz=01;31:*.cab=01;31:*.wim=01;31:*.swm=01;31:*.dwm=01;31:*.esd=01;31:*.jpg=01;35:*.jpeg=01;35:*.mjpg=01;35:*..mjpeg=01;35:*.gif=01;35:*.bmp=01;35:*.pbm=01;35:*.pgm=01;35:*.ppm=01;35:*.tga=01;35:*.xbm=01;35:*.xpm=01;35:*.tif=01;35:*.tiff=01;35:*.png=01;35:*.svg=01;35:*.svgz=01;35:*.mng=01;35:*.pcx=01;35:*.mov=01;35:*.mpg=01;35:*.mpeg=01;35:*.m2v=01;35:*.mkv=01;35:*.webm=01;35:*.webp=01;35:*.ogm=01;35:*.mp4=01;35:*.m4v=01;35:*.mp4v=01;35:*.vob=01;35:*.qt=01;35:*.nuv=01;35:*.wmv=01;35:*.asf=01;35:*.rm=01;35:*.rmvb=01;35:*.flc=01;35:*.avi=01;35:*.fli=01;35:*..flv=01;35:*.gl=01;35:*.dl=01;35:*.xcf=01;35:*.xwd=01;35:*.yuv=01;35:*.cgm=01;35:*.emf=01;35:*.ogv=01;35:*.ogx=01;35:*.aac=00;36:*.au=00;36:*.flac=00;36:*.m4a=00;36:*.mid=00;36:*.midi=00;36:*.mka=00;36:*.mp3=00;36:*.mpc=00;36:*.ogg=00;36:*.ra=00;36:*.wav=00;36:*.oga=00;36:*.opus=00;36:*.spx=00;36:*.xspf=00;36: SSH_AUTH_SOCK => deleted TEST_PHPDBG_EXECUTABLE => /home/ubuntu/php-src/sapi/phpdbg/phpdbg SHELL => /usr/bin/zsh TEST_PHP_EXECUTABLE_ESCAPED => '/home/ubuntu/php-src/sapi/cli/php' MAKE_TERMOUT => /dev/pts/11 PWD => /home/ubuntu/php-src SSH_CONNECTION => deleted CC => cc MFLAGS => TEST_PHPDBG_EXECUTABLE_ESCAPED => '/home/ubuntu/php-src/sapi/phpdbg/phpdbg' PHP Variables Variable => Value $_SERVER['USER'] => ubuntu $_SERVER['SSH_CLIENT'] => deleted $_SERVER['XDG_SESSION_TYPE'] => tty $_SERVER['SHLVL'] => 2 $_SERVER['TEST_PHP_SRCDIR'] => /home/ubuntu/php-src $_SERVER['LESS'] => -R $_SERVER['MOTD_SHOWN'] => pam $_SERVER['HOME'] => /home/ubuntu $_SERVER['OLDPWD'] => /home/ubuntu $_SERVER['SSH_TTY'] => deleted $_SERVER['LSCOLORS'] => Gxfxcxdxbxegedabagacad $_SERVER['ZSH'] => /home/ubuntu/.oh-my-zsh $_SERVER['PAGER'] => less $_SERVER['TEST_PHP_CGI_EXECUTABLE'] => /home/ubuntu/php-src/sapi/cgi/php-cgi $_SERVER['MAKEFLAGS'] => $_SERVER['DBUS_SESSION_BUS_ADDRESS'] => unix:path=/run/user/1000/bus $_SERVER['MAKE_TERMERR'] => /dev/pts/11 $_SERVER['LOGNAME'] => ubuntu $_SERVER['TEST_PHP_EXECUTABLE'] => /home/ubuntu/php-src/sapi/cli/php $_SERVER['_'] => /home/ubuntu/php-src/sapi/cli/php $_SERVER['XDG_SESSION_CLASS'] => user $_SERVER['TERM'] => xterm-256color $_SERVER['XDG_SESSION_ID'] => 211 $_SERVER['PATH'] => /home/ubuntu/bin:/usr/local/bin:/usr/local/sbin:/usr/local/bin:/usr/sbin:/usr/bin:/sbin:/bin:/usr/games:/usr/local/games:/snap/bin $_SERVER['TEST_PHP_CGI_EXECUTABLE_ESCAPED'] => '/home/ubuntu/php-src/sapi/cgi/php-cgi' $_SERVER['MAKELEVEL'] => 1 $_SERVER['XDG_RUNTIME_DIR'] => /run/user/1000 $_SERVER['LANG'] => C.UTF-8 $_SERVER['LS_COLORS'] => rs=0:di=01;34:ln=01;36:mh=00:pi=40;33:so=01;35:do=01;35:bd=40;33;01:cd=40;33;01:or=40;31;01:mi=00:su=37;41:sg=30;43:ca=30;41:tw=30;42:ow=34;42:st=37;44:ex=01;32:*.tar=01;31:*.tgz=01;31:*.arc=01;31:*.arj=01;31:*.taz=01;31:*.lha=01;31:*.lz4=01;31:*.lzh=01;31:*.lzma=01;31:*.tlz=01;31:*.txz=01;31:*.tzo=01;31:*.t7z=01;31:*.zip=01;31:*.z=01;31:*.dz=01;31:*.gz=01;31:*.lrz=01;31:*.lz=01;31:*.lzo=01;31:*.xz=01;31:*.zst=01;31:*.tzst=01;31:*.bz2=01;31:*.bz=01;31:*.tbz=01;31:*.tbz2=01;31:*..tz=01;31:*.deb=01;31:*.rpm=01;31:*.jar=01;31:*.war=01;31:*.ear=01;31:*.sar=01;31:*.rar=01;31:*.alz=01;31:*.ace=01;31:*.zoo=01;31:*.cpio=01;31:*.7z=01;31:*.rz=01;31:*.cab=01;31:*.wim=01;31:*.swm=01;31:*.dwm=01;31:*.esd=01;31:*.jpg=01;35:*.jpeg=01;35:*.mjpg=01;35:*.mjpeg=01;35:*.gif=01;35:*.bmp=01;35:*.pbm=01;35:*.pgm=01;35:*.ppm=01;35:*.tga=01;35:*.xbm=01;35:*.xpm=01;35:*.tif=01;35:*.tiff=01;35:*.png=01;35:*.svg=01;35:*.svgz=01;35:*.mng=01;35:*.pcx=01;35:*.mov=01;35:*.mpg=01;35:*.mpeg=01;35:*.m2v=01;35:*.mkv=01;35:*.webm=01;35:*.webp=01;35:*.ogm=01;35:*.mp4=01;35:*.m4v=01;35:*.mp4v=01;35:*.vob=01;35:*.qt=01;35:*.nuv=01;35:*.wmv=01;35:*.asf=01;35:*.rm=01;35:*.rmvb=01;35:*.flc=01;35:*.avi=01;35:*.fli=01;35:*.flv=01;35:*.gl=01;35:*.dl=01;35:*.xcf=01;35:*.xwd=01;35:*.yuv=01;35:*.cgm=01;35:*.emf=01;35:*.ogv=01;35:*.ogx=01;35:*.aac=00;36:*.au=00;36:*.flac=00;36:*.m4a=00;36:*.mid=00;36:*.midi=00;36:*.mka=00;36:*.mp3=00;36:*.mpc=00;36:*.ogg=00;36:*.ra=00;36:*.wav=00;36:*.oga=00;36:*.opus=00;36:*.spx=00;36:*.xspf=00;36: $_SERVER['SSH_AUTH_SOCK'] => deleted $_SERVER['TEST_PHPDBG_EXECUTABLE'] => /home/ubuntu/php-src/sapi/phpdbg/phpdbg $_SERVER['SHELL'] => /usr/bin/zsh $_SERVER['TEST_PHP_EXECUTABLE_ESCAPED'] => '/home/ubuntu/php-src/sapi/cli/php' $_SERVER['MAKE_TERMOUT'] => /dev/pts/11 $_SERVER['PWD'] => /home/ubuntu/php-src $_SERVER['SSH_CONNECTION'] => deleted $_SERVER['CC'] => cc $_SERVER['MFLAGS'] => $_SERVER['TEST_PHPDBG_EXECUTABLE_ESCAPED'] => '/home/ubuntu/php-src/sapi/phpdbg/phpdbg' $_SERVER['PHP_SELF'] => $_SERVER['SCRIPT_NAME'] => $_SERVER['SCRIPT_FILENAME'] => $_SERVER['PATH_TRANSLATED'] => $_SERVER['DOCUMENT_ROOT'] => $_SERVER['REQUEST_TIME_FLOAT'] => 1679719972.2655 $_SERVER['REQUEST_TIME'] => 1679719972 $_SERVER['argv'] => Array ( ) $_SERVER['argc'] => 0 $_ENV['USER'] => ubuntu $_ENV['SSH_CLIENT'] => deleted $_ENV['XDG_SESSION_TYPE'] => tty $_ENV['SHLVL'] => 2 $_ENV['TEST_PHP_SRCDIR'] => /home/ubuntu/php-src $_ENV['LESS'] => -R $_ENV['MOTD_SHOWN'] => pam $_ENV['HOME'] => /home/ubuntu $_ENV['OLDPWD'] => /home/ubuntu $_ENV['SSH_TTY'] => deleted $_ENV['LSCOLORS'] => Gxfxcxdxbxegedabagacad $_ENV['ZSH'] => /home/ubuntu/.oh-my-zsh $_ENV['PAGER'] => less $_ENV['TEST_PHP_CGI_EXECUTABLE'] => /home/ubuntu/php-src/sapi/cgi/php-cgi $_ENV['MAKEFLAGS'] => $_ENV['DBUS_SESSION_BUS_ADDRESS'] => unix:path=/run/user/1000/bus $_ENV['MAKE_TERMERR'] => /dev/pts/11 $_ENV['LOGNAME'] => ubuntu $_ENV['TEST_PHP_EXECUTABLE'] => /home/ubuntu/php-src/sapi/cli/php $_ENV['_'] => /home/ubuntu/php-src/sapi/cli/php $_ENV['XDG_SESSION_CLASS'] => user $_ENV['TERM'] => xterm-256color $_ENV['XDG_SESSION_ID'] => 211 $_ENV['PATH'] => /home/ubuntu/bin:/usr/local/bin:/usr/local/sbin:/usr/local/bin:/usr/sbin:/usr/bin:/sbin:/bin:/usr/games:/usr/local/games:/snap/bin $_ENV['TEST_PHP_CGI_EXECUTABLE_ESCAPED'] => '/home/ubuntu/php-src/sapi/cgi/php-cgi' $_ENV['MAKELEVEL'] => 1 $_ENV['XDG_RUNTIME_DIR'] => /run/user/1000 $_ENV['LANG'] => C.UTF-8 $_ENV['LS_COLORS'] => rs=0:di=01;34:ln=01;36:mh=00:pi=40;33:so=01;35:do=01;35:bd=40;33;01:cd=40;33;01:or=40;31;01:mi=00:su=37;41:sg=30;43:ca=30;41:tw=30;42:ow=34;42:st=37;44:ex=01;32:*.tar=01;31:*.tgz=01;31:*.arc=01;31:*.arj=01;31:*.taz=01;31:*.lha=01;31:*.lz4=01;31:*.lzh=01;31:*.lzma=01;31:*.tlz=01;31:*.txz=01;31:*.tzo=01;31:*.t7z=01;31:*.zip=01;31:*.z=01;31:*.dz=01;31:*.gz=01;31:*.lrz=01;31:*.lz=01;31:*.lzo=01;31:*.xz=01;31:*.zst=01;31:*.tzst=01;31:*.bz2=01;31:*.bz=01;31:*.tbz=01;31:*.tbz2=01;31:*.tz=01;31:*.deb=01;31:*.rpm=01;31:*.jar=01;31:*.war=01;31:*.ear=01;31:*.sar=01;31:*.rar=01;31:*.alz=01;31:*.ace=01;31:*.zoo=01;31:*.cpio=01;31:*.7z=01;31:*.rz=01;31:*.cab=01;31:*.wim=01;31:*.swm=01;31:*.dwm=01;31:*.esd=01;31:*.jpg=01;35:*.jpeg=01;35:*.mjpg=01;35:*.mjpeg=01;35:*.gif=01;35:*.bmp=01;35:*.pbm=01;35:*.pgm=01;35:*.ppm=01;35:*.tga=01;35:*.xbm=01;35:*.xpm=01;35:*.tif=01;35:*.tiff=01;35:*.png=01;35:*.svg=01;35:*.svgz=01;35:*.mng=01;35:*.pcx=01;35:*.mov=01;35:*.mpg=01;35:*.mpeg=01;35:*.m2v=01;35:*.mkv=01;35:*.webm=01;35:*.webp=01;35:*.ogm=01;35:*.mp4=01;35:*.m4v=01;35:*.mp4v=01;35:*.vob=01;35:*.qt=01;35:*.nuv=01;35:*.wmv=01;35:*.asf=01;35:*.rm=01;35:*.rmvb=01;35:*.flc=01;35:*.avi=01;35:*.fli=01;35:*.flv=01;35:*.gl=01;35:*.dl=01;35:*.xcf=01;35:*.xwd=01;35:*..yuv=01;35:*.cgm=01;35:*.emf=01;35:*.ogv=01;35:*.ogx=01;35:*.aac=00;36:*.au=00;36:*.flac=00;36:*.m4a=00;36:*.mid=00;36:*.midi=00;36:*.mka=00;36:*.mp3=00;36:*.mpc=00;36:*.ogg=00;36:*.ra=00;36:*..wav=00;36:*.oga=00;36:*.opus=00;36:*.spx=00;36:*.xspf=00;36: $_ENV['SSH_AUTH_SOCK'] => deleted $_ENV['TEST_PHPDBG_EXECUTABLE'] => /home/ubuntu/php-src/sapi/phpdbg/phpdbg $_ENV['SHELL'] => /usr/bin/zsh $_ENV['TEST_PHP_EXECUTABLE_ESCAPED'] => '/home/ubuntu/php-src/sapi/cli/php' $_ENV['MAKE_TERMOUT'] => /dev/pts/11 $_ENV['PWD'] => /home/ubuntu/php-src $_ENV['SSH_CONNECTION'] => deleted $_ENV['CC'] => cc $_ENV['MFLAGS'] => $_ENV['TEST_PHPDBG_EXECUTABLE_ESCAPED'] => '/home/ubuntu/php-src/sapi/phpdbg/phpdbg' PHP License This program is free software; you can redistribute it and/or modify it under the terms of the PHP License as published by the PHP Group and included in the distribution in the file: LICENSE This program is distributed in the hope that it will be useful, but WITHOUT ANY WARRANTY; without even the implied warranty of MERCHANTABILITY or FITNESS FOR A PARTICULAR PURPOSE. If you did not receive a copy of the PHP license, or have any questions about PHP licensing, please contact license@php.net. ``` ### PHP Version 8.3.0-dev ### Operating System Ubuntu 22.04.2 LTS

« previous php.bugs (#244003) next »