[php-src] Issue #12070: Make Test : FAILED TEST

From: Date: Tue, 29 Aug 2023 08:05:47 +0000
Subject: [php-src] Issue #12070: Make Test : FAILED TEST
Groups: php.bugs 
Request: Send a blank email to php-bugs+get-245278@lists.php.net to get a copy of this message
Issue: https://github.com/php/php-src/issues/12070 Author: Mathieudewet ### Description The following code: ```php <?php ``` Resulted in this output: ``` ``` But I expected this output instead: ``` ``` ===================================================================== TIME END 2023-08-29 07:36:52 ===================================================================== TEST RESULT SUMMARY --------------------------------------------------------------------- Exts skipped : 46 Exts tested : 28 --------------------------------------------------------------------- Number of tests : 18043 12740 Tests skipped : 5303 ( 29.4%) -------- Tests warned : 2 ( 0.0%) ( 0.0%) Tests failed : 1 ( 0.0%) ( 0.0%) Expected fail : 7 ( 0.0%) ( 0.1%) Tests passed : 12730 ( 70.6%) ( 99.9%) --------------------------------------------------------------------- Time taken : 375 seconds ===================================================================== ===================================================================== EXPECTED FAILED TEST SUMMARY --------------------------------------------------------------------- Test open_basedir configuration [tests/security/open_basedir_linkinfo.phpt] XFAIL REASON: BUG: open_basedir cannot delete symlink to prohibited file. See also bugs 48111 and 52176. Bug #42718 (unsafe_raw filter not applied when configured as default filter) [ext/filter/tests/bug42718.phpt] XFAIL REASON: FILTER_UNSAFE_RAW not applied when configured as default filter, even with flags Bug #67296 (filter_input doesn't validate variables) [ext/filter/tests/bug49184.phpt] XFAIL REASON: See Bug #49184 Bug #67167: filter_var(null,FILTER_VALIDATE_BOOLEAN,FILTER_NULL_ON_FAILURE) returns null [ext/filter/tests/bug67167.02.phpt] XFAIL REASON: Requires php_zval_filter to not use convert_to_string for all filters. Return type check elision [ext/opcache/tests/opt/verify_return_type.phpt] XFAIL REASON: Return types cannot be inferred through prototypes via [ext/pdo_sqlite/tests/common.phpt] SQLite PDO Common: PDOStatement::getColumnMeta [ext/pdo_sqlite/tests/pdo_022.phpt] XFAIL REASON: This feature is not yet finalized, no test makes sense updateTimestamp never called when session data is empty [ext/session/tests/bug71162.phpt] XFAIL REASON: Current session module is designed to write empty session always. In addition, current session module only supports SessionHandlerInterface only from PHP 7.0. ===================================================================== ===================================================================== FAILED TEST SUMMARY --------------------------------------------------------------------- Bug #80067 (Omitting the port in bindto setting errors) [ext/standard/tests/network/bug80067.phpt] ===================================================================== ===================================================================== WARNED TEST SUMMARY --------------------------------------------------------------------- Phar: bug #69958: Segfault in Phar::convertToData on invalid file [ext/phar/tests/bug69958.phpt] (warn: XFAIL section but test passes) FPM: Buffered worker output decorated log with multiple continuous messages (stdout/stderr mixed) [sapi/fpm/tests/log-bwd-multiple-msgs-stdout-stderr.phpt] (warn: XFAIL section but test passes) ===================================================================== You may have found a problem in PHP. This report can be saved and used to open an issue on the bug tracker at https://github.com/php/php-src/issues This gives us a better understanding of PHP's behavior. Do you want to save this report in a file? [Yn]: Y sh: 1: autoconf: not found Report saved to: /home/ubuntu/php-8.2.9/php_test_results_20230829_0730.txt make: *** [Makefile:217: test] Error 1 [php_test_results_20230829_0730.txt](https://github.com/php/php-src/files/12461669/php_test_results_20230829_0730.txt) ### PHP Version PHP 8.2.9 ### Operating System Ubuntu 20.04.1

« previous php.bugs (#245278) next »