Bug #16076: apache 2.0.32 sapi_apache2.c compile failure
| From: | eric at wynja dot com | Date: | Thu, 14 Mar 2002 17:15:16 +0000 |
| Subject: | Bug #16076: apache 2.0.32 sapi_apache2.c compile failure | ||
| Groups: | php.bugs | ||
| Request: | Send a blank email to php-bugs+get-2504@lists.php.net to get a copy of this message | ||
From: eric@wynja.com
Operating system: linux 2.4.17
PHP version: 4.1.2
PHP Bug Type: Apache2 related
Bug description: apache 2.0.32 sapi_apache2.c compile failure
./configure --with-mysql --with-apxs2=/usr/local/bin/apxs
no problem
make
...
Making all in sapi
make[1]: Entering directory `/usr/local/src/php-4.1.2/sapi'
Making all in apache2filter
make[2]: Entering directory
`/usr/local/src/php-4.1.2/sapi/apache2filter'
make[3]: Entering directory
`/usr/local/src/php-4.1.2/sapi/apache2filter'
/bin/sh /usr/local/src/php-4.1.2/libtool --silent
--mode=compile /usr/local/src/php-4.1.2/meta_ccld -I.
-I/usr/local/src/php-4.1.2/sapi/apache2filter
-I/usr/local/src/php-4.1.2/main -I/usr/local/src/php-4.1.2
-I/usr/local/include -I/usr/local/src/php-4.1.2/Zend
-I/usr/local/src/php-4.1.2/ext/mysql/libmysql
-I/usr/local/src/php-4.1.2/ext/xml/expat -D_REENTRANT
-I/usr/local/src/php-4.1.2/TSRM -DTHREAD=1 -O3 -march=i686
-pthread -DZTS -prefer-pic -c
sapi_apache2.csapi_apache2.c: In function
`php_apache_sapi_register_variables':
sapi_apache2.c:148: warning: initialization discards
qualifiers from pointer target type
sapi_apache2.c: In function `php_input_filter':
sapi_apache2.c:247: incompatible type for argument 4 of
`ap_get_brigade'
sapi_apache2.c:247: too few arguments to function
`ap_get_brigade'
sapi_apache2.c: In function `php_register_hook':
sapi_apache2.c:408: warning: passing arg 2 of
`ap_register_input_filter' from
incompatible pointer type
make[3]: *** [sapi_apache2.lo] Error 1
make[3]: Leaving directory
`/usr/local/src/php-4.1.2/sapi/apache2filter'
make[2]: *** [all-recursive] Error 1
make[2]: Leaving directory
`/usr/local/src/php-4.1.2/sapi/apache2filter'
make[1]: *** [all-recursive] Error 1
make[1]: Leaving directory `/usr/local/src/php-4.1.2/sapi'
make: *** [all-recursive] Error 1
--
Edit bug report at http://bugs.php.net/?id=16076&edit=1
--
Fixed in CVS: http://bugs.php.net/fix.php?id=16076&r=fixedcvs
Fixed in release: http://bugs.php.net/fix.php?id=16076&r=alreadyfixed
Need backtrace: http://bugs.php.net/fix.php?id=16076&r=needtrace
Try newer version: http://bugs.php.net/fix.php?id=16076&r=oldversion
Not developer issue: http://bugs.php.net/fix.php?id=16076&r=support
Expected behavior: http://bugs.php.net/fix.php?id=16076&r=notwrong
Not enough info: http://bugs.php.net/fix.php?id=16076&r=notenoughinfo
Submitted twice: http://bugs.php.net/fix.php?id=16076&r=submittedtwice