#20687 [Opn->Fbk]: Compile error on dbase module
| From: | sniper@php.net | Date: | Fri, 29 Nov 2002 06:53:13 +0000 |
| Subject: | #20687 [Opn->Fbk]: Compile error on dbase module | ||
| References: | 1 | Groups: | php.bugs |
| Request: | Send a blank email to php-bugs+get-26138@lists.php.net to get a copy of this message | ||
ID: 20687
Updated by: sniper@php.net
Reported By: aboos@univag.com.br
-Status: Open
+Status: Feedback
Bug Type: Compile Failure
Operating System: linux redhat 7.1 gcc 2.96
PHP Version: 4.2.3
New Comment:
I didn't ask you to use the ext/dbase from the snapshot but the whole
new PHP version altogether..
And I'm pretty sure this is not a bug as it compiles just fine here..
Previous Comments:
------------------------------------------------------------------------
[2002-11-28 12:03:11] aboos@univag.com.br
after to use lastest cvs version...
[root@fw-adm dbase]# phpize
aclocal: macro `AC_ADD_LIBRARY' defined in acinclude.m4 but never used
aclocal: macro `AC_ADD_INCLUDE' defined in acinclude.m4 but never used
aclocal: macro `AC_ADD_LIBPATH' defined in acinclude.m4 but never used
aclocal: macro `AC_ADD_LIBRARY_WITH_PATH' defined in acinclude.m4 but
never used
[root@fw-adm dbase]# ./configure
configure: error: can not find sources in . or ..
[root@fw-adm dbase]#
[]'s
------------------------------------------------------------------------
[2002-11-28 05:22:39] sniper@php.net
Please try using this CVS snapshot:
http://snaps.php.net/php4-latest.tar.gz
For Windows:
http://snaps.php.net/win32/php4-win32-latest.zip
------------------------------------------------------------------------
[2002-11-27 19:26:21] aboos@univag.com.br
Hi...
I was trying to compile module dbase and during the process he returns
me the following mistake:
dbf_head.c:249:49: too many arguments for macro "VCWD_OPEN"
dbf_head.c:252:48: too many arguments for macro "VCWD_OPEN"
make[1]: *** [dbf_head.slo] Error 1
make[1]: Leaving directory `/root/php-4.2.3/ext/dbase'
make: *** [all-recursive] Error 1
Sequence of commands:
/root/php-4.2.3/ext/dbase/phpize
/root/php-4.2.3/ext/dbase/./configure
/root/php-4.2.3/ext/dbase/make
------------------------------------------------------------------------
--
Edit this bug report at http://bugs.php.net/?id=20687&edit=1