#25148 [Bgs]: php-4.3.2.tar.bz2 contain corrupted file fastcgi.dsp

From: Date: Wed, 20 Aug 2003 04:44:07 +0000
Subject: #25148 [Bgs]: php-4.3.2.tar.bz2 contain corrupted file fastcgi.dsp
References: 1  Groups: php.bugs 
Request: Send a blank email to php-bugs+get-46278@lists.php.net to get a copy of this message
ID: 25148 User updated by: abi dot jabar at alumni dot usc dot edu Reported By: abi dot jabar at alumni dot usc dot edu Status: Bogus Bug Type: *Compile Issues Operating System: Windows XP PHP Version: 4.3.2 New Comment: Thanks. I was felt down with your first comment. I am not C++ expert but I really want to start with PHP and MySQL. I have corrected the error and now using the coorect file. I find another error. I attached the compiler message and I am working on it (learning by doing). Thanks for the correction. ATTACHMENT ------ Rebuild All started: Project: TSRM, Configuration: Release_TS_inline Win32 ------ Deleting intermediate files and output files for project 'TSRM', configuration 'Release_TS_inline|Win32'. Compiling... tsrm_win32.c tsrm_virtual_cwd.c tsrm_strtok_r.c TSRM.c Creating library... Build log was saved at "file://c:\Documents and Settings\Abi Jabar\My Documents\Visual Studio Projects\PHP - Hypertexts Processor\php-4.3.2\TSRM\Release_TS_inline\BuildLog.htm" TSRM - 0 error(s), 0 warning(s) ------ Rebuild All started: Project: libmysql, Configuration: Release Win32 ------ Deleting intermediate files and output files for project 'libmysql', configuration 'Release|Win32'. Compiling... violite.c typelib.c thr_mutex.c strxmov.c strtoull.c strtoll.c strnmov.c strmov.c strmake.c strinstr.c string.c strfill.c strend.c strcont.c strcend.c str2int.c safemalloc.c password.c net.c my_write.c my_winthread.c my_wincond.c my_thr_init.c my_tempnam.c my_static.c my_realloc.c my_read.c my_pthread.c my_open.c my_once.c my_net.c my_messnc.c my_malloc.c my_lib.c my_init.c my_getwd.c my_fopen.c my_error.c my_div.c my_delete.c my_create.c my_compress.c my_alloc.c mulalloc.c mf_wcomp.c mf_unixpath.c mf_path.c mf_pack.c mf_loadpath.c mf_format.c mf_fn_ext.c mf_dirname.c mf_casecnv.c longlong2str.c list.c libmysql.c libmysql.c(923) : warning C4018: '>' : signed/unsigned mismatch libmysql.c(982) : warning C4018: '>' : signed/unsigned mismatch is_prefix.c int2str.c get_password.c errors.c errmsg.c dll.c default.c dbug.c ctype.c charset.c bmove_upp.c bmove.c bchange.c array.c Creating library... Build log was saved at "file://c:\Documents and Settings\Abi Jabar\My Documents\Visual Studio Projects\PHP - Hypertexts Processor\php-4.3.2\ext\mysql\libmysql\Release\BuildLog.htm" libmysql - 0 error(s), 2 warning(s) ------ Rebuild All started: Project: ZendTS, Configuration: Release_TSDbg Win32 ------ Deleting intermediate files and output files for project 'ZendTS', configuration 'Release_TSDbg|Win32'. Performing Custom Build Step c:/usr/local/lib/bison.simple: No such file or directory bison: Project : error PRJ0019: A tool returned an error code: "Performing Custom Build Step" ZendTS : error PRJ0002 : error result returned from 'C:\DOCUME~1\ABIJAB~1\LOCALS~1\Temp\BAT000008.bat'. Build log was saved at "file://c:\Documents and Settings\Abi Jabar\My Documents\Visual Studio Projects\PHP - Hypertexts Processor\php-4.3.2\Zend\Release_TSDbg\BuildLog.htm" ZendTS - 1 error(s), 0 warning(s) ------ Rebuild All started: Project: php4dllts, Configuration: Release_TSDbg Win32 ------ Deleting intermediate files and output files for project 'php4dllts', configuration 'Release_TSDbg|Win32'. Generating ext/standard/parsedate.c c:/usr/local/lib/bison.simple: No such file or directory bison: Project : error PRJ0019: A tool returned an error code: "Generating ext/standard/parsedate.c" php4dllts : error PRJ0002 : error result returned from 'C:\DOCUME~1\ABIJAB~1\LOCALS~1\Temp\BAT00000C.bat'. Build log was saved at "file://c:\Documents and Settings\Abi Jabar\My Documents\Visual Studio Projects\PHP - Hypertexts Processor\php-4.3.2\win32\Release_TSDbg\BuildLog.htm" php4dllts - 1 error(s), 0 warning(s) ------ Rebuild All started: Project: php4ts, Configuration: Release_TS Win32 ------ Deleting intermediate files and output files for project 'php4ts', configuration 'Release_TS|Win32'. Compiling... os_win32.c fcgiapp.c getopt.c cgi_main.c Generating Code... Compiling resources... Linking... LINK : fatal error LNK1181: cannot open input file 'php4ts.lib' Build log was saved at "file://c:\Documents and Settings\Abi Jabar\My Documents\Visual Studio Projects\PHP - Hypertexts Processor\php-4.3.2\win32\Release_TS\BuildLog.htm" php4ts - 1 error(s), 0 warning(s) ------ Rebuild All started: Project: php4isapi, Configuration: Release_TSDbg Win32 ------ Deleting intermediate files and output files for project 'php4isapi', configuration 'Release_TSDbg|Win32'. Compiling... php4isapi.c Linking... LINK : fatal error LNK1181: cannot open input file 'php4ts.lib' Build log was saved at "file://c:\Documents and Settings\Abi Jabar\My Documents\Visual Studio Projects\PHP - Hypertexts Processor\php-4.3.2\sapi\isapi\Release_TSDbg\BuildLog.htm" php4isapi - 1 error(s), 0 warning(s) ------ Rebuild All started: Project: php4nsapi, Configuration: Release_TS Win32 ------ Deleting intermediate files and output files for project 'php4nsapi', configuration 'Release_TS|Win32'. Compiling... nsapi.c C:\Documents and Settings\Abi Jabar\My Documents\Visual Studio Projects\PHP - Hypertexts Processor\win32build\include\nsapi.h(2949) : warning C4005: 'strcasecmp' : macro redefinition c:\Documents and Settings\Abi Jabar\My Documents\Visual Studio Projects\PHP - Hypertexts Processor\php-4.3.2\Zend\zend_config.w32.h(50) : see previous definition of 'strcasecmp' C:\Documents and Settings\Abi Jabar\My Documents\Visual Studio Projects\PHP - Hypertexts Processor\win32build\include\nsapi.h(2954) : warning C4005: 'strncasecmp' : macro redefinition c:\Documents and Settings\Abi Jabar\My Documents\Visual Studio Projects\PHP - Hypertexts Processor\php-4.3.2\Zend\zend_config.w32.h(51) : see previous definition of 'strncasecmp' nsapi.c(228) : warning C4018: '<' : signed/unsigned mismatch nsapi.c(249) : warning C4018: '<' : signed/unsigned mismatch nsapi.c(316) : warning C4018: '<' : signed/unsigned mismatch nsapi.c(489) : warning C4090: 'function' : different 'const' qualifiers nsapi.c(491) : warning C4090: 'function' : different 'const' qualifiers Linking... LINK : fatal error LNK1181: cannot open input file 'php4ts.lib' Build log was saved at "file://c:\Documents and Settings\Abi Jabar\My Documents\Visual Studio Projects\PHP - Hypertexts Processor\php-4.3.2\sapi\nsapi\Release_TS\BuildLog.htm" php4nsapi - 1 error(s), 7 warning(s) ------ Rebuild All started: Project: php4pi3web, Configuration: Release_TS Win32 ------ Deleting intermediate files and output files for project 'php4pi3web', configuration 'Release_TS|Win32'. Compiling... pi3web_sapi.c pi3web_sapi.c(38) : fatal error C1083: Cannot open include file: 'PiAPI.h': No such file or directory Build log was saved at "file://c:\Documents and Settings\Abi Jabar\My Documents\Visual Studio Projects\PHP - Hypertexts Processor\php-4.3.2\sapi\pi3web\Release_TS\BuildLog.htm" php4pi3web - 1 error(s), 0 warning(s) ------ Rebuild All started: Project: php4apache2, Configuration: Release_TS Win32 ------ Deleting intermediate files and output files for project 'php4apache2', configuration 'Release_TS|Win32'. Compiling... sapi_apache2.c sapi_apache2.c(38) : fatal error C1083: Cannot open include file: 'apr_strings.h': No such file or directory php_functions.c php_functions.c(29) : fatal error C1083: Cannot open include file: 'apr_strings.h': No such file or directory apache_config.c c:\Documents and Settings\Abi Jabar\My Documents\Visual Studio Projects\PHP - Hypertexts Processor\php-4.3.2\sapi\apache2handler\php_apache.h(24) : fatal error C1083: Cannot open include file: 'httpd.h': No such file or directory Build log was saved at "file://c:\Documents and Settings\Abi Jabar\My Documents\Visual Studio Projects\PHP - Hypertexts Processor\php-4.3.2\sapi\apache2handler\Release_TS\BuildLog.htm" php4apache2 - 3 error(s), 0 warning(s) ------ Rebuild All started: Project: php4apache, Configuration: Release_TS Win32 ------ Deleting intermediate files and output files for project 'php4apache', configuration 'Release_TS|Win32'. Compiling... sapi_apache.c ..\..\main\php_regex.h(39) : fatal error C1083: Cannot open include file: 'regex.h': No such file or directory php_apache.c ..\..\main\php_regex.h(39) : fatal error C1083: Cannot open include file: 'regex.h': No such file or directory mod_php4.c ..\..\main\php_regex.h(39) : fatal error C1083: Cannot open include file: 'regex.h': No such file or directory Build log was saved at "file://c:\Documents and Settings\Abi Jabar\My Documents\Visual Studio Projects\PHP - Hypertexts Processor\php-4.3.2\sapi\apache\Release_TS\BuildLog.htm" php4apache - 3 error(s), 0 warning(s) ------ Rebuild All started: Project: php4aolserver, Configuration: Release_TS_inline Win32 ------ Deleting intermediate files and output files for project 'php4aolserver', configuration 'Release_TS_inline|Win32'. Compiling... aolserver.c aolserver.c(49) : fatal error C1083: Cannot open include file: 'ns.h': No such file or directory Build log was saved at "file://c:\Documents and Settings\Abi Jabar\My Documents\Visual Studio Projects\PHP - Hypertexts Processor\php-4.3.2\sapi\aolserver\Release_TS_inline\BuildLog.htm" php4aolserver - 1 error(s), 0 warning(s) ------ Rebuild All started: Project: php4activescript, Configuration: Release_TS Win32 ------ Deleting intermediate files and output files for project 'php4activescript', configuration 'Release_TS|Win32'. Compiling... scriptengine.cpp scriptengine.cpp(1280) : warning C4554: '&' : check operator precedence for possible error; use parentheses to clarify precedence php4activescript.c classfactory.cpp Linking... LINK : fatal error LNK1181: cannot open input file 'php4ts.lib' Build log was saved at "file://c:\Documents and Settings\Abi Jabar\My Documents\Visual Studio Projects\PHP - Hypertexts Processor\php-4.3.2\sapi\activescript\Release_TS\BuildLog.htm" php4activescript - 1 error(s), 1 warning(s) ------ Rebuild All started: Project: php4ts_cli, Configuration: Release_TSDbg Win32 ------ Deleting intermediate files and output files for project 'php4ts_cli', configuration 'Release_TSDbg|Win32'. Compiling... php_cli.c getopt.c Generating Code... Compiling resources... Linking... LINK : fatal error LNK1181: cannot open input file 'php4ts.lib' Build log was saved at "file://c:\Documents and Settings\Abi Jabar\My Documents\Visual Studio Projects\PHP - Hypertexts Processor\php-4.3.2\win32\Release_TSDbg\BuildLog.htm" php4ts_cli - 1 error(s), 0 warning(s) ------ Rebuild All started: Project: servlet, Configuration: Release Win32 ------ Deleting intermediate files and output files for project 'servlet', configuration 'Release|Win32'. Performing Custom Build Step The system cannot find the path specified. The system cannot find the path specified. Compiling... servlet.c servlet.c(19) : fatal error C1083: Cannot open include file: 'jni.h': No such file or directory java.c ..\..\main\php.h(50) : fatal error C1083: Cannot open include file: 'tsrm_win32.h': No such file or directory Project : warning PRJ0018 : The following environment variables were not found: $(JAVA_HOME) Build log was saved at "file://c:\Documents and Settings\Abi Jabar\My Documents\Visual Studio Projects\PHP - Hypertexts Processor\php-4.3.2\sapi\servlet\Release\BuildLog.htm" servlet - 2 error(s), 0 warning(s) ------ Rebuild All started: Project: testsuite, Configuration: Release_TS_Inline Win32 ------ Deleting intermediate files and output files for project 'testsuite', configuration 'Release_TS_Inline|Win32'. Running Testsuite, please wait... '.\..\..\php.exe' is not recognized as an internal or external command, operable program or batch file. Project : error PRJ0019: A tool returned an error code: "Running Testsuite, please wait..." Build log was saved at "file://c:\Documents and Settings\Abi Jabar\My Documents\Visual Studio Projects\PHP - Hypertexts Processor\BuildLog.htm" testsuite - 1 error(s), 0 warning(s) ---------------------- Done ---------------------- Rebuild All: 2 succeeded, 13 failed, 0 skipped Previous Comments: ------------------------------------------------------------------------ [2003-08-19 18:43:06] sniper@php.net You just using the wrong .dsw (read the docs at http://www.php.net/manual/en/install.windows.php#install.windows.build) (you should be using php4ts.dsw) ------------------------------------------------------------------------ [2003-08-19 18:37:48] sniper@php.net I find this a bit amusing, since there is no such file in that package at all..and it compiles just fine too. :) ------------------------------------------------------------------------ [2003-08-19 10:38:17] abi dot jabar at alumni dot usc dot edu Description: ------------ The downloaded file php-4.3.2.tar.bz2 contain corrupted file fastcgi.dsp. I downloaded 3 times from 3 different mirror site (HongKong, Australia and USA) and extract using zigzag utility. When I opened with Visual Studio .NET 2002, error message appeared : fastcgi.dsp is corrupted. I repeat with the file from Australia and then USA the result were same. I have not tried with php-4.3.2.tar.gz. Thanks. ------------------------------------------------------------------------ -- Edit this bug report at http://bugs.php.net/?id=25148&edit=1

« previous php.bugs (#46278) next »