#25528 [NEW]: make: *** [ext/bcmath/bcmath.lo] Error 1

From: Date: Sat, 13 Sep 2003 23:01:19 +0000
Subject: #25528 [NEW]: make: *** [ext/bcmath/bcmath.lo] Error 1
Groups: php.bugs 
Request: Send a blank email to php-bugs+get-47541@lists.php.net to get a copy of this message
From: thomas dot hebinck at digionline dot de Operating system: Linux Debian Woody PHP version: 5CVS-2003-09-13 (dev) PHP Bug Type: Compile Failure Bug description: make: *** [ext/bcmath/bcmath.lo] Error 1 Description: ------------ I think, there is not much to say ;-) Bye, Thomas. Reproduce code: --------------- ./configure \ --with-apxs2=/usr/local/apache/bin/apxs \ --prefix=/usr/local/apache/php \ --with-config-file-path=/usr/local/apache/php \ --with-ldap \ --with-pgsql=/usr/local/pgsql \ --with-imap=/usr/src/imap-2002d/c-client \ --with-imap-ssl=/usr/local/ssl \ --enable-bcmath make Actual result: -------------- w23:/usr/src/php5-200309132130# make /bin/sh /usr/src/php5-200309132130/libtool --silent --preserve-dup-deps --mode=compile gcc -I/usr/src/php5-200309132130/ext/bcmath/libbcmath/src -Iext/bcmath/ -I/usr/src/php5-200309132130/ext/bcmath/ -DPHP_ATOM_INC -I/usr/src/php5-200309132130/include -I/usr/src/php5-200309132130/main -I/usr/src/php5-200309132130 -I/usr/src/php5-200309132130/Zend -I/usr/local/include/libxml2 -I/usr/src/imap-2002d/c-client -I/usr/local/include -I/usr/local/pgsql/include -I/usr/src/php5-200309132130/TSRM -g -O2 -prefer-pic -c /usr/src/php5-200309132130/ext/bcmath/bcmath.c -o ext/bcmath/bcmath.lo In file included from /usr/src/php5-200309132130/main/php.h:34, from /usr/src/php5-200309132130/ext/bcmath/bcmath.c:25: /usr/src/php5-200309132130/Zend/zend.h:357: argument format specified for non-function `error_function' /usr/src/php5-200309132130/Zend/zend.h:358: argument format specified for non-function `printf_function' /usr/src/php5-200309132130/Zend/zend.h:496: argument format specified for non-function `zend_printf' /usr/src/php5-200309132130/Zend/zend.h:502: argument format specified for non-function `zend_error_cb' make: *** [ext/bcmath/bcmath.lo] Error 1 -- Edit bug report at http://bugs.php.net/?id=25528&edit=1 -- Try a CVS snapshot (php4): http://bugs.php.net/fix.php?id=25528&r=trysnapshot4 Try a CVS snapshot (php5): http://bugs.php.net/fix.php?id=25528&r=trysnapshot5 Fixed in CVS: http://bugs.php.net/fix.php?id=25528&r=fixedcvs Fixed in release: http://bugs.php.net/fix.php?id=25528&r=alreadyfixed Need backtrace: http://bugs.php.net/fix.php?id=25528&r=needtrace Try newer version: http://bugs.php.net/fix.php?id=25528&r=oldversion Not developer issue: http://bugs.php.net/fix.php?id=25528&r=support Expected behavior: http://bugs.php.net/fix.php?id=25528&r=notwrong Not enough info: http://bugs.php.net/fix.php?id=25528&r=notenoughinfo Submitted twice: http://bugs.php.net/fix.php?id=25528&r=submittedtwice register_globals: http://bugs.php.net/fix.php?id=25528&r=globals PHP 3 support discontinued: http://bugs.php.net/fix.php?id=25528&r=php3 Daylight Savings: http://bugs.php.net/fix.php?id=25528&r=dst IIS Stability: http://bugs.php.net/fix.php?id=25528&r=isapi Install GNU Sed: http://bugs.php.net/fix.php?id=25528&r=gnused

« previous php.bugs (#47541) next »