#25536 [Opn]: PHP 3.0.18 + Apache 1.3.27 INSTALL ERROR

From: Date: Mon, 15 Sep 2003 07:09:59 +0000
Subject: #25536 [Opn]: PHP 3.0.18 + Apache 1.3.27 INSTALL ERROR
References: 1  Groups: php.bugs 
Request: Send a blank email to php-bugs+get-47580@lists.php.net to get a copy of this message
ID: 25536 User updated by: dow1112 at intizen dot com Reported By: dow1112 at intizen dot com Status: Open Bug Type: Compile Failure Operating System: solaris8 sparc PHP Version: Irrelevant New Comment: 5)./configure --acgivate-module=src/modules/php3/libphp3.a (php-3.0.18) 6)make (php-3.0.18) ==> sorry~. (php-3.0.18) -> (apache_1.3.27) Previous Comments: ------------------------------------------------------------------------ [2003-09-15 03:02:35] dow1112 at intizen dot com Description: ------------ Hello, I have installed PHP 3.0.18 / Apache 1.3.27 solaris 8 sparc have followed the instructions given in PHP Documentation for installing but i got the following error..... please help me... I could't sleep for 5days...because this problem. Reproduce code: --------------- 1)./configure (apache_1.3.27) 2)./configure --with-apache=../apache_1.3.27 (php-3.0.18) --with-mysql=/usr/local/mysql --enable-track-vars 3)make (php-3.0.18) 4)make install (php-3.0.18) 5)./configure --acgivate-module=src/modules/php3/libphp3.a (php-3.0.18) 6)make (php-3.0.18) ==> occur error!! Expected result: ---------------- ---------------error--------------------------------- ld: Ä¡¸íÀû: ±âÈ£ ÂüÁ¶ ¿À·ù. httpd¿¡ Ãâ·ÂÀÌ ±â·ÏµÇÁö ¾ÊÀ½ (sign error) (output don't record) collect2: ld returned 1 exit status make[2]: *** [target_static] Error 1 make[2]: Leaving directory `/home/mdr/last_APM/apache_1.3.27/src' make[1]: *** [build-std] Error 2 make[1]: Leaving directory `/home/mdr/last_APM/apache_1.3.27' make: *** [build] Error 2 -------------------------------------------------------- ------------------------------------------------------------------------ -- Edit this bug report at http://bugs.php.net/?id=25536&edit=1

« previous php.bugs (#47580) next »