ID: 25547
Comment by: bart at atsence dot nl
Reported By: cschneid at cschneid dot com
Status: Verified
Bug Type: Scripting Engine problem
Operating System: *
PHP Version: 4CVS
New Comment:
I am afraid the patch did not have the desired effect for me. I am
still faced with the error (when making a make test) after compiling
php with sablotron, see below.
I patched the php-4.3.4 tarball with:
patch -p1 < bug25547.patch
Result is an error
File to patch: php-4.3.4.tar.gz
patching file php-4.3.4.tar.gz
Hunk #1 FAILED at 638.
1 out of 1 hunk FAILED -- saving rejects to file php-4.3.4.tar.gz.rej
FAILED TEST SUMMARY
---------------------------------------------------------------------
Bug #25547 (error_handler and array index with function call)
[tests/lang/bug25547.phpt]
xslt_set_object function [ext/xslt/tests/xslt_set_object.phpt]
Ideas anyone?
Previous Comments:
------------------------------------------------------------------------
[2004-01-16 22:50:20] jclift at digitaldistribution dot com
Just experienced this when doing a "make test" with PHP 4.3.5RC1, on a
newly installed Sun Java Desktop System (a stripped down version of
SuSE Linux).
------------------------------------------------------------------------
[2004-01-11 02:59:51] jclift at digitaldistribution dot com
That patch fixed my 4.3.4 release tarball, running on Sun's JDS,
compiled in CLI mode.
Look like we'll be waiting for the 4.3.5 release now.
;-)
Regards and best wishes,
Justin Clift
------------------------------------------------------------------------
[2004-01-04 22:45:47] cvianna at stech dot net dot br
The patch applied perfectly, and the make test didnt find any error
after this.
Altough, my problem ([Mon Jan 5 01:48:52 2004] [notice] child pid 3965
exit signal Segmentation fault (11)
) every time I access an php page, persists. Not associated :) Back to
google.
------------------------------------------------------------------------
[2004-01-04 17:53:24] cschneid at cschneid dot com
A workaround patch (without memory leak ;-)) can be found at
http://cschneid.com/php/php4/bug25547.patch
------------------------------------------------------------------------
[2004-01-04 17:49:09] cschneid at cschneid dot com
Problem still exists in PHP4 branch
------------------------------------------------------------------------
The remainder of the comments for this report are too long. To view
the rest of the comments, please view the bug report online at
http://bugs.php.net/25547--
Edit this bug report at http://bugs.php.net/?id=25547&edit=1