Bug #16833 Updated: make file error1 during install of php

From: Date: Fri, 26 Apr 2002 01:59:39 +0000
Subject: Bug #16833 Updated: make file error1 during install of php
References: 1  Groups: php.bugs 
Request: Send a blank email to php-bugs+get-6041@lists.php.net to get a copy of this message
ID: 16833 Updated by: sniper@php.net Reported By: vivienne.gilmore@noaa.gov -Status: Open +Status: Feedback -Bug Type: *Compile Issues +Bug Type: MySQL related Operating System: Solaris 8 PHP Version: 4.2.0 New Comment: This is most likely cause by the autoconf 2.52 used to create the distribution configure. Please try replacing it with this one http://www.edin.dk/php/configure.gz Previous Comments: ------------------------------------------------------------------------ [2002-04-25 17:19:06] vivienne.gilmore@noaa.gov EMANTICS -I/export/home/sb/done/php-4.2.0/TSRM -g -O2 -c libmysql.c && touch libmysql.lo In file included from libmysql.c:5: global.h:136: parse error In file included from libmysql.c:5: global.h:498: parse error In file included from libmysql.c:12: m_string.h:205: parse error make[4]: *** [libmysql.lo] Error 1 make[4]: Leaving directory `/export/home/sb/done/php-4.2.0/ext/mysql/libmysql' make[3]: *** [all-recursive] Error 1 make[3]: Leaving directory `/export/home/sb/done/php-4.2.0/ext/mysql/libmysql' make[2]: *** [all-recursive] Error 1 make[2]: Leaving directory `/export/home/sb/done/php-4.2.0/ext/mysql' make[1]: *** [all-recursive] Error 1 make[1]: Leaving directory `/export/home/sb/done/php-4.2.0/ext' make: *** [all-recursive] Error 1 ------------------------------------------------------------------------ -- Edit this bug report at http://bugs.php.net/?id=16833&edit=1

« previous php.bugs (#6041) next »